{"text_format":"1","workbook":"xlsx","n_sheets":11,"sheets":["Datos","TD","Menu","PP001","PP002","PP016","PP017","PP018","PP024","PP031","OTROS"],"not_rendered":{"charts":0,"images":37,"macros":1,"external_links":1,"defined_names":41,"comments":1,"pivot_tables":10},"unopened":[],"bounds":{"document_bytes":16777216,"sheet_cells":100000,"rows_first":2000,"rows_last":500,"rows_between":2000,"halvings":0,"cell_chars":16384,"cell_head_chars":4096},"cells_cut":0,"cells_raw":0,"read":"whole","date_system":"1900"}

{"sheet":"Datos","index":0,"n_rows":436,"n_cols":36,"rows_kept":436,"cut":false,"hidden":true,"merged":[]}
[]
[]
[]
[]
[]
[]
[]
[]
[null,"ANO",null,"MESES",null,"COD_RED","DESC_RED","RED",null,"COD_RED","COD_MIC","DESC_MICRO","MICROREDES",null,"COD_ESTAB","DESC_ESTAB","COD_RED","COD_MIC","COD_PROV","COD_DIST","REDMIC","CONCATENAR",null,"COD_PROV","DESC_PROV","CONCATENAR",null,"COD_PROV","COD_DIST","DESC_DIST","PROVDIST","CONCATENAR",null,"UE"]
[null,2024,null,"01-Enero",null,"01","CUSCO SUR",{"$f":"CONCATENATE(F10,\" - \",G10)","v":"01 - CUSCO SUR"},null,"00","00","NO PERTENECE A NINGUNA MICRORED                                                                     ",{"$f":"CONCATENATE(J10,K10,\" - \",L10)","v":"0000 - NO PERTENECE A NINGUNA MICRORED                                                                     "},null,"000000000","(All)","07","00",null,null,{"$f":"CONCATENATE(Q10,R10)","v":"0700"},{"$f":"CONCATENATE(O10,\" - \",P10)","v":"000000000 - (All)"},null,"00","(All)",{"$f":"CONCATENATE(X10,\" - \",Y10)","v":"00 - (All)"},null,"01","00","(All)",{"$f":"CONCATENATE(AB10,AC10)","v":"0100"},{"$f":"CONCATENATE(AB10,AC10,\" - \",AD10)","v":"0100 - (All)"},null,"COD_RED","DESC_RED","CONCATENAR"]
[null,null,null,"02-Febrero",null,"02","CUSCO NORTE","02 - CUSCO NORTE",null,"00","99","(All)",{"$f":"CONCATENATE(J11,K11,\" - \",L11)","v":"0099 - (All)"},null,"000002289","HOSPITAL REGIONAL CUSCO","07","00","01","01",{"$f":"CONCATENATE(Q11,R11)","v":"0700"},{"$f":"CONCATENATE(O11,\" - \",P11)","v":"000002289 - HOSPITAL REGIONAL CUSCO"},null,"01","CUSCO",{"$f":"CONCATENATE(X11,\" - \",Y11)","v":"01 - CUSCO"},null,"01","01","CUSCO",{"$f":"CONCATENATE(AB11,AC11)","v":"0101"},{"$f":"CONCATENATE(AB11,AC11,\" - \",AD11)","v":"0101 - CUSCO"},null,1129,"UE - SALUD CANAS - CANCHIS - ESPINAR",{"$f":"CONCATENATE(AH11,\" - \",AI11)","v":"1129 - UE - SALUD CANAS - CANCHIS - ESPINAR"}]
[null,null,null,"03-Marzo",null,"03","LA CONVENCION","03 - LA CONVENCION",null,"01","00","HOSPITAL","0100 - HOSPITAL",null,"000002305","HOSPITAL ANTONIO LORENA","07","00","01","06",{"$f":"CONCATENATE(Q12,R12)","v":"0700"},"000002305 - HOSPITAL ANTONIO LORENA",null,"02","ACOMAYO",{"$f":"CONCATENATE(X12,\" - \",Y12)","v":"02 - ACOMAYO"},null,"01","02","CCORCA","0102","0102 - CCORCA",null,1130,"UE - HOSPITAL REGIONAL CUSCO",{"$f":"CONCATENATE(AH12,\" - \",AI12)","v":"1130 - UE - HOSPITAL REGIONAL CUSCO"}]
[null,null,null,"04-Abril",null,"04","CANAS-CANCHIS-ESPINAR","04 - CANAS-CANCHIS-ESPINAR",null,"01","03","PARURO                                                                                              ","0103 - PARURO                                                                                              ",null,"999999999","(All)","07","99",null,null,{"$f":"CONCATENATE(Q13,R13)","v":"0799"},"999999999 - (All)",null,"03","ANTA","03 - ANTA",null,"01","03","POROY","0103","0103 - POROY",null,1169,"UE - HOSPITAL ANTONIO LORENA","1169 - UE - HOSPITAL ANTONIO LORENA"]
[null,null,null,"05-Mayo",null,"05","KIMBIRI PICHARI","05 - KIMBIRI PICHARI",null,"01","06","PAUCARTAMBO                                                                                         ","0106 - PAUCARTAMBO                                                                                         ",null,"000025210","TUPAC AMARU","01","00","01","05","0100","000025210 - TUPAC AMARU",null,"04","CALCA","04 - CALCA",null,"01","04","SAN JERONIMO","0104","0104 - SAN JERONIMO",null,1170,"UE - SALUD LA CONVENCION","1170 - UE - SALUD LA CONVENCION"]
[null,null,null,"06-Junio",null,"06","CHUMBIVILCAS","06 - CHUMBIVILCAS",null,"01","12","URCOS                                                                                               ","0112 - URCOS                                                                                               ",null,"000000000","(All)","01","16",null,null,{"$f":"CONCATENATE(Q15,R15)","v":"0116"},{"$f":"CONCATENATE(O15,\" - \",P15)","v":"000000000 - (All)"},null,"05","CANAS","05 - CANAS",null,"01","05","SAN SEBASTIAN","0105","0105 - SAN SEBASTIAN",null,1322,"UE - SALUD CUSCO SUR","1322 - UE - SALUD CUSCO SUR"]
[null,null,null,"07-Julio",null,"07","HOSPITALES III",{"$f":"CONCATENATE(F16,\" - \",G16)","v":"07 - HOSPITALES III"},null,"01","13","ACOMAYO                                                                                             ","0113 - ACOMAYO                                                                                             ",null,"000002300","SAN JERONIMO                                                                                        ","01","16","01","04","0116","000002300 - SAN JERONIMO                                                                                        ",null,"06","CANCHIS","06 - CANCHIS",null,"01","06","SANTIAGO","0106","0106 - SANTIAGO",null,1347,"UE - SALUD KIMBIRI PICHARI","1347 - UE - SALUD KIMBIRI PICHARI"]
[null,null,null,"08-Agosto",null,"99","(All)",{"$f":"CONCATENATE(F17,\" - \",G17)","v":"99 - (All)"},null,"01","15","OCONGATE                                                                                            ","0115 - OCONGATE                                                                                            ",null,"000002301","SAN SEBASTIAN                                                                                       ","01","16","01","05","0116","000002301 - SAN SEBASTIAN                                                                                       ",null,"07","CHUMBIVILCAS","07 - CHUMBIVILCAS",null,"01","07","SAYLLA","0107","0107 - SAYLLA",null,1348,"UE - SALUD CUSCO NORTE","1348 - UE - SALUD CUSCO NORTE"]
[null,null,null,"09-Setiembre",null,null,null,null,null,"01","16","CUSCO","0116 - CUSCO",null,"000002303","SANTA ROSA                                                                                          ","01","16","01","05","0116","000002303 - SANTA ROSA                                                                                          ",null,"08","ESPINAR","08 - ESPINAR",null,"01","08","WANCHAQ","0108","0108 - WANCHAQ",null,1547,"UE - HOSPITAL ESPINAR","1547 - UE - HOSPITAL ESPINAR"]
[null,null,null,"10-Octubre",null,null,null,null,null,"01","99","(All)","0199 - (All)",null,"000002314","SAYLLA                                                                                              ","01","16","01","07","0116","000002314 - SAYLLA                                                                                              ",null,"09","LA CONVENCION","09 - LA CONVENCION",null,"02","00","(All)","0200","0200 - (All)",null,1625,"UE - HOSPITAL SICUANI","1625 - UE - HOSPITAL SICUANI"]
[null,null,null,"11-Noviembre",null,null,null,null,null,"02","01","BELEMPAMPA                                                                                          ","0201 - BELEMPAMPA                                                                                          ",null,"000002323","RONDOCAN                                                                                            ","01","16","02","06","0116","000002323 - RONDOCAN                                                                                            ",null,"10","PARURO","10 - PARURO",null,"02","01","ACOMAYO","0201","0201 - ACOMAYO",null,1626,"UE - HOSPITAL QUILLABAMBA","1626 - UE - HOSPITAL QUILLABAMBA"]
[null,null,null,"12-Diciembre",null,null,null,null,null,"02","02","WANCHAQ                                                                                             ","0202 - WANCHAQ                                                                                             ",null,"000007699","CONCHACALLE                                                                                         ","01","16","01","04","0116","000007699 - CONCHACALLE                                                                                         ",null,"11","PAUCARTAMBO","11 - PAUCARTAMBO",null,"02","02","ACOPIA","0202","0202 - ACOPIA",null,1666,"UE - SALUD CHUMBIVILCAS","1666 - UE - SALUD CHUMBIVILCAS"]
[null,null,null,null,null,null,null,null,null,"02","03","ANTA                                                                                                ","0203 - ANTA                                                                                                ",null,"000010065","ESSALUD-SAN SEBASTIAN","01","16","01","05","0116","000010065 - ESSALUD-SAN SEBASTIAN",null,"12","QUISPICANCHI","12 - QUISPICANCHI",null,"02","03","ACOS","0203","0203 - ACOS",null,"7777","(All)",{"$f":"CONCATENATE(AH22,\" - \",AI22)","v":"7777 - (All)"}]
[null,null,null,null,null,null,null,null,null,"02","04","LIMATAMBO                                                                                           ","0204 - LIMATAMBO                                                                                           ",null,"000011743","SANIDAD-SANTA ROSA PNP","01","16","01","05","0116","000011743 - SANIDAD-SANTA ROSA PNP",null,"13","URUBAMBA","13 - URUBAMBA",null,"02","04","MOSOC LLACTA","0204","0204 - MOSOC LLACTA"]
[null,null,null,null,null,null,null,null,null,"02","05","PISAC                                                                                               ","0205 - PISAC                                                                                               ",null,"000026181","MENTAL SAN SEBASTIAN","01","16","01","05","0116","000026181 - MENTAL SAN SEBASTIAN",null,null,null,null,null,"02","05","POMACANCHI","0205","0205 - POMACANCHI"]
[null,null,null,null,null,null,null,null,null,"02","06","CALCA                                                                                               ","0206 - CALCA                                                                                               ",null,"000030727","PATRÓN SAN SEBASTIAN","01","16","01","04",{"$f":"CONCATENATE(Q25,R25)","v":"0116"},"000030727 - PATRÓN SAN SEBASTIAN",null,null,null,null,null,"02","06","RONDOCAN","0206","0206 - RONDOCAN"]
[null,null,null,null,null,null,null,null,null,"02","07","URUBAMBA                                                                                            ","0207 - URUBAMBA                                                                                            ",null,"000000000","(All)","01","03",null,null,{"$f":"CONCATENATE(Q26,R26)","v":"0103"},"000000000 - (All)",null,null,null,null,null,"02","07","SANGARARA","0207","0207 - SANGARARA"]
[null,null,null,null,null,null,null,null,null,"02","08","YANATILE                                                                                            ","0208 - YANATILE                                                                                            ",null,"000002499","PARURO                                                                                              ","01","03",10,"01","0103","000002499 - PARURO                                                                                              ",null,null,null,null,null,"03","00","(All)","0300","0300 - (All)"]
[null,null,null,null,null,null,null,null,null,"02","09","SIETE CUARTONES                                                                                     ","0209 - SIETE CUARTONES                                                                                     ",null,"000002500","ACCHA                                                                                               ","01","03",10,"02","0103","000002500 - ACCHA                                                                                               ",null,null,null,null,null,"03","01","ANTA","0301","0301 - ANTA"]
[null,null,null,null,null,null,null,null,null,"02","99","(All)","0299 - (All)",null,"000002501","CCAPI                                                                                               ","01","03",10,"03","0103","000002501 - CCAPI                                                                                               ",null,null,null,null,null,"03","02","ANCAHUASI","0302","0302 - ANCAHUASI"]
[null,null,null,null,null,null,null,null,null,"03","00","HOSPITAL","0300 - HOSPITAL",null,"000002502","CCOYABAMBA                                                                                          ","01","03",10,"03","0103","000002502 - CCOYABAMBA                                                                                          ",null,null,null,null,null,"03","03","CACHIMAYO","0303","0303 - CACHIMAYO"]
[null,null,null,null,null,null,null,null,null,"03","01","SANTA ANA                                                                                           ","0301 - SANTA ANA                                                                                           ",null,"000002503","COLCHA                                                                                              ","01","03",10,"04","0103","000002503 - COLCHA                                                                                              ",null,null,null,null,null,"03","04","CHINCHAYPUJIO","0304","0304 - CHINCHAYPUJIO"]
[null,null,null,null,null,null,null,null,null,"03","02","MARANURA                                                                                            ","0302 - MARANURA                                                                                            ",null,"000002504","HUANOQUITE                                                                                          ","01","03",10,"05","0103","000002504 - HUANOQUITE                                                                                          ",null,null,null,null,null,"03","05","HUAROCONDO","0305","0305 - HUAROCONDO"]
[null,null,null,null,null,null,null,null,null,"03","03","QUELLOUNO                                                                                           ","0303 - QUELLOUNO                                                                                           ",null,"000002505","OMACHA                                                                                              ","01","03",10,"06","0103","000002505 - OMACHA                                                                                              ",null,null,null,null,null,"03","06","LIMATAMBO","0306","0306 - LIMATAMBO"]
[null,null,null,null,null,null,null,null,null,"03","04","KITENI                                                                                              ","0304 - KITENI                                                                                              ",null,"000002506","ANTAPALLPA                                                                                          ","01","03",10,"06","0103","000002506 - ANTAPALLPA                                                                                          ",null,null,null,null,null,"03","07","MOLLEPATA","0307","0307 - MOLLEPATA"]
[null,null,null,null,null,null,null,null,null,"03","05","KAMISEA                                                                                             ","0305 - KAMISEA                                                                                             ",null,"000002507","PACCARECTAMBO                                                                                       ","01","03",10,"07","0103","000002507 - PACCARECTAMBO                                                                                       ",null,null,null,null,null,"03","08","PUCYURA","0308","0308 - PUCYURA"]
[null,null,null,null,null,null,null,null,null,"03","06","PUCYURA                                                                                             ","0306 - PUCYURA                                                                                             ",null,"000002509","YAURISQUE                                                                                           ","01","03",10,"09","0103","000002509 - YAURISQUE                                                                                           ",null,null,null,null,null,"03","09","ZURITE","0309","0309 - ZURITE"]
[null,null,null,null,null,null,null,null,null,"03","99","(All)","0399 - (All)",null,"000006978","CCOCHIRIHUAY                                                                                        ","01","03",10,"04","0103","000006978 - CCOCHIRIHUAY                                                                                        ",null,null,null,null,null,"04","00","(All)","0400","0400 - (All)"]
[null,null,null,null,null,null,null,null,null,"04","00","HOSPITAL","0400 - HOSPITAL",null,"000007147","HUASQUILLAY                                                                                         ","01","03",10,"06","0103","000007147 - HUASQUILLAY                                                                                         ",null,null,null,null,null,"04","01","CALCA","0401","0401 - CALCA"]
[null,null,null,null,null,null,null,null,null,"04","01","YANAOCA                                                                                             ","0401 - YANAOCA                                                                                             ",null,"000012924","SAHUA SAHUA                                                                                         ","01","03",10,"06","0103","000012924 - SAHUA SAHUA                                                                                         ",null,null,null,null,null,"04","02","COYA","0402","0402 - COYA"]
[null,null,null,null,null,null,null,null,null,"04","02","EL DESCANSO                                                                                         ","0402 - EL DESCANSO                                                                                         ",null,"000000000","(All)","01","06",null,null,"0106","000000000 - (All)",null,null,null,null,null,"04","03","LAMAY","0403","0403 - LAMAY"]
[null,null,null,null,null,null,null,null,null,"04","03","COMBAPATA                                                                                           ","0403 - COMBAPATA                                                                                           ",null,"000002510","PAUCARTAMBO                                                                                         ","01","06",11,"01","0106","000002510 - PAUCARTAMBO                                                                                         ",null,null,null,null,null,"04","04","LARES","0404","0404 - LARES"]
[null,null,null,null,null,null,null,null,null,"04","04","TECHO OBRERO                                                                                        ","0404 - TECHO OBRERO                                                                                        ",null,"000002511","MOLLOMARCA                                                                                          ","01","06",11,"01","0106","000002511 - MOLLOMARCA                                                                                          ",null,null,null,null,null,"04","05","PISAC","0405","0405 - PISAC"]
[null,null,null,null,null,null,null,null,null,"04","05","PAMPAPHALLA                                                                                         ","0405 - PAMPAPHALLA                                                                                         ",null,"000002512","CAICAY                                                                                              ","01","06",11,"02","0106","000002512 - CAICAY                                                                                              ",null,null,null,null,null,"04","06","SAN SALVADOR","0406","0406 - SAN SALVADOR"]
[null,null,null,null,null,null,null,null,null,"04","06","YAURI                                                                                               ","0406 - YAURI                                                                                               ",null,"000002513","HUASAC                                                                                              ","01","06",11,"02","0106","000002513 - HUASAC                                                                                              ",null,null,null,null,null,"04","07","TARAY","0407","0407 - TARAY"]
[null,null,null,null,null,null,null,null,null,"04","99","(All)","0499 - (All)",null,"000002514","CHALLABAMBA                                                                                         ","01","06",11,"03","0106","000002514 - CHALLABAMBA                                                                                         ",null,null,null,null,null,"04","08","YANATILE","0408","0408 - YANATILE"]
[null,null,null,null,null,null,null,null,null,"05","00","HOSPITAL","0500 - HOSPITAL",null,"000002516","COLQUEPATA                                                                                          ","01","06",11,"04","0106","000002516 - COLQUEPATA                                                                                          ",null,null,null,null,null,"05","00","(All)","0500","0500 - (All)"]
[null,null,null,null,null,null,null,null,null,"05","01","KIMBIRI                                                                                             ","0501 - KIMBIRI                                                                                             ",null,"000002517","PICHIHUA COLQUEPATA                                                                                 ","01","06",11,"04","0106","000002517 - PICHIHUA COLQUEPATA                                                                                 ",null,null,null,null,null,"05","01","YANAOCA","0501","0501 - YANAOCA"]
[null,null,null,null,null,null,null,null,null,"05","02","PICHARI                                                                                             ","0502 - PICHARI                                                                                             ",null,"000002518","VIZCOCHONI                                                                                          ","01","06",11,"04","0106","000002518 - VIZCOCHONI                                                                                          ",null,null,null,null,null,"05","02","CHECCA","0502","0502 - CHECCA"]
[null,null,null,null,null,null,null,null,null,"05","99","(All)","0599 - (All)",null,"000002519","AYRE                                                                                                ","01","06",11,"04","0106","000002519 - AYRE                                                                                                ",null,null,null,null,null,"05","03","KUNTURKANKI","0503","0503 - KUNTURKANKI"]
[null,null,null,null,null,null,null,null,null,"06","00","HOSPITAL","0600 - HOSPITAL",null,"000002520","HUANCARANI                                                                                          ","01","06",11,"05","0106","000002520 - HUANCARANI                                                                                          ",null,null,null,null,null,"05","04","LANGUI","0504","0504 - LANGUI"]
[null,null,null,null,null,null,null,null,null,"06","09","SANTO TOMAS                                                                                         ","0609 - SANTO TOMAS                                                                                         ",null,"000002521","PILCOPATA                                                                                           ","01","06",11,"06","0106","000002521 - PILCOPATA                                                                                           ",null,null,null,null,null,"05","05","LAYO","0505","0505 - LAYO"]
[null,null,null,null,null,null,null,null,null,"06","01","LIVITACA                                                                                            ","0601 - LIVITACA                                                                                            ",null,"000002522","PATRIA                                                                                              ","01","06",11,"06","0106","000002522 - PATRIA                                                                                              ",null,null,null,null,null,"05","06","PAMPAMARCA","0506","0506 - PAMPAMARCA"]
[null,null,null,null,null,null,null,null,null,"06","99","(All)","0699 - (All)",null,"000006979","TOCRA                                                                                               ","01","06",11,"04","0106","000006979 - TOCRA                                                                                               ",null,null,null,null,null,"05","07","QUEHUE","0507","0507 - QUEHUE"]
[null,null,null,null,null,null,null,null,null,"07","00","HOSPITAL","0700 - HOSPITAL",null,"000010077","ESSALUD-PAUCARTAMBO","01","06",11,"01","0106","000010077 - ESSALUD-PAUCARTAMBO",null,null,null,null,null,"05","08","TUPAC AMARU","0508","0508 - TUPAC AMARU"]
[null,null,null,null,null,null,null,null,null,"99","99","(All)",{"$f":"CONCATENATE(J55,K55,\" - \",L55)","v":"9999 - (All)"},null,"000033777","MENTAL COMUNITARIO VIRGEN DEL ROSARIO","01","06",11,"01","0106","000033777 - MENTAL COMUNITARIO VIRGEN DEL ROSARIO",null,null,null,null,null,"06","00","(All)","0600","0600 - (All)"]
[null,null,null,null,null,null,null,null,null,null,null,null,null,null,"000000000","(All)","01","12",null,null,"0112","000000000 - (All)",null,null,null,null,null,"06","01","SICUANI","0601","0601 - SICUANI"]
[null,null,null,null,null,null,null,null,null,null,null,null,null,null,"000002523","URCOS                                                                                               ","01","12",12,"01","0112","000002523 - URCOS                                                                                               ",null,null,null,null,null,"06","02","CHECACUPE","0602","0602 - CHECACUPE"]
[null,null,null,null,null,null,null,null,null,null,null,null,null,null,"000002525","ANDAHUAYLILLAS                                                                                      ","01","12",12,"02","0112","000002525 - ANDAHUAYLILLAS                                                                                      ",null,null,null,null,null,"06","03","COMBAPATA","0603","0603 - COMBAPATA"]
[null,null,null,null,null,null,null,null,null,null,null,null,null,null,"000002530","CUSIPATA                                                                                            ","01","12",12,"06","0112","000002530 - CUSIPATA                                                                                            ",null,null,null,null,null,"06","04","MARANGANI","0604","0604 - MARANGANI"]
[null,null,null,null,null,null,null,null,null,null,null,null,null,null,"000002532","HUARO                                                                                               ","01","12",12,"07","0112","000002532 - HUARO                                                                                               ",null,null,null,null,null,"06","05","PITUMARCA","0605","0605 - PITUMARCA"]
[null,null,null,null,null,null,null,null,null,null,null,null,null,null,"000002533","URPAY                                                                                               ","01","12",12,"07","0112","000002533 - URPAY                                                                                               ",null,null,null,null,null,"06","06","SAN PABLO","0606","0606 - SAN PABLO"]
[null,null,null,null,null,null,null,null,null,null,null,null,null,null,"000002534","LUCRE                                                                                               ","01","12",12,"08","0112","000002534 - LUCRE                                                                                               ",null,null,null,null,null,"06","07","SAN PEDRO","0607","0607 - SAN PEDRO"]
[null,null,null,null,null,null,null,null,null,null,null,null,null,null,"000002537","OROPESA                                                                                             ","01","12",12,11,"0112","000002537 - OROPESA                                                                                             ",null,null,null,null,null,"06","08","TINTA","0608","0608 - TINTA"]
[null,null,null,null,null,null,null,null,null,null,null,null,null,null,"000002538","QUIQUIJANA                                                                                          ","01","12",12,12,"0112","000002538 - QUIQUIJANA                                                                                          ",null,null,null,null,null,"07","00","(All)","0700","0700 - (All)"]
[null,null,null,null,null,null,null,null,null,null,null,null,null,null,"000002539","CCOLCA","01","12",12,12,"0112","000002539 - CCOLCA",null,null,null,null,null,"07","01","SANTO TOMAS","0701","0701 - SANTO TOMAS"]
[null,null,null,null,null,null,null,null,null,null,null,null,null,null,"000006980","CHILLIHUANI                                                                                         ","01","12",12,"06","0112","000006980 - CHILLIHUANI                                                                                         ",null,null,null,null,null,"07","02","CAPACMARCA","0702","0702 - CAPACMARCA"]
[null,null,null,null,null,null,null,null,null,null,null,null,null,null,"000008911","HUARA HUARA                                                                                         ","01","12",12,"05","0112","000008911 - HUARA HUARA                                                                                         ",null,null,null,null,null,"07","03","CHAMACA","0703","0703 - CHAMACA"]
[null,null,null,null,null,null,null,null,null,null,null,null,null,null,"000011747","SANIDAD-PUCUTO PNP","01","12",12,"07","0112","000011747 - SANIDAD-PUCUTO PNP",null,null,null,null,null,"07","04","COLQUEMARCA","0704","0704 - COLQUEMARCA"]
[null,null,null,null,null,null,null,null,null,null,null,null,null,null,"000026385","ESSALUD-URCOS","01","12",12,"01","0112","000026385 - ESSALUD-URCOS",null,null,null,null,null,"07","05","LIVITACA","0705","0705 - LIVITACA"]
[null,null,null,null,null,null,null,null,null,null,null,null,null,null,"000030708","MENTAL COMUNITARIO HUARO","01","12",12,"07","0112","000030708 - MENTAL COMUNITARIO HUARO",null,null,null,null,null,"07","06","LLUSCO","0706","0706 - LLUSCO"]
[null,null,null,null,null,null,null,null,null,null,null,null,null,null,"000000000","(All)","01","13",null,null,"0113","000000000 - (All)",null,null,null,null,null,"07","07","QUIÑOTA","0707","0707 - QUIÑOTA"]
[null,null,null,null,null,null,null,null,null,null,null,null,null,null,"000002317","ACOMAYO                                                                                             ","01","13","02","01","0113","000002317 - ACOMAYO                                                                                             ",null,null,null,null,null,"07","08","VELILLE","0708","0708 - VELILLE"]
[null,null,null,null,null,null,null,null,null,null,null,null,null,null,"000002318","ACOPIA                                                                                              ","01","13","02","02","0113","000002318 - ACOPIA                                                                                              ",null,null,null,null,null,"08","00","(All)","0800","0800 - (All)"]
[null,null,null,null,null,null,null,null,null,null,null,null,null,null,"000002319","ACOS                                                                                                ","01","13","02","03","0113","000002319 - ACOS                                                                                                ",null,null,null,null,null,"08","01","ESPINAR","0801","0801 - ESPINAR"]
[null,null,null,null,null,null,null,null,null,null,null,null,null,null,"000002321","CENTRO DE SALUD POMACANCHI","01","13","02","05","0113",{"$f":"CONCATENATE(O75,\" - \",P75)","v":"000002321 - CENTRO DE SALUD POMACANCHI"},null,null,null,null,null,"08","02","CONDOROMA",{"$f":"CONCATENATE(AB75,AC75)","v":"0802"},{"$f":"CONCATENATE(AB75,AC75,\" - \",AD75)","v":"0802 - CONDOROMA"}]
[null,null,null,null,null,null,null,null,null,null,null,null,null,null,"000002322","SAN JUAN DE POMACANCHI                                                                              ","01","13","02","05","0113","000002322 - SAN JUAN DE POMACANCHI                                                                              ",null,null,null,null,null,"08","03","COPORAQUE","0803","0803 - COPORAQUE"]
[null,null,null,null,null,null,null,null,null,null,null,null,null,null,"000002324","PUESTO DE SALUD SANGARARA","01","13","02","07","0113","000002324 - PUESTO DE SALUD SANGARARA",null,null,null,null,null,"08","04","OCORURO","0804","0804 - OCORURO"]
[null,null,null,null,null,null,null,null,null,null,null,null,null,null,"000002325","PUESTO DE SALUD MARCACONGA","01","13","02","07","0113","000002325 - PUESTO DE SALUD MARCACONGA",null,null,null,null,null,"08","05","PALLPATA","0805","0805 - PALLPATA"]
[null,null,null,null,null,null,null,null,null,null,null,null,null,null,"000002508","PILLPINTO                                                                                           ","01","13",10,"08","0113","000002508 - PILLPINTO                                                                                           ",null,null,null,null,null,"08","06","PICHIGUA","0806","0806 - PICHIGUA"]
[null,null,null,null,null,null,null,null,null,null,null,null,null,null,"000010076","ESSALUD-ACOMAYO","01","13","02","01","0113","000010076 - ESSALUD-ACOMAYO",null,null,null,null,null,"08","07","SUYCKUTAMBO","0807","0807 - SUYCKUTAMBO"]
[null,null,null,null,null,null,null,null,null,null,null,null,null,null,"000012926","SANTA  LUCIA                                                                                        ","01","13","02","05","0113","000012926 - SANTA  LUCIA                                                                                        ",null,null,null,null,null,"08","08","ALTO PICHIGUA","0808","0808 - ALTO PICHIGUA"]
[null,null,null,null,null,null,null,null,null,null,null,null,null,null,"000000000","(All)","01","15",null,null,"0115","000000000 - (All)",null,null,null,null,null,"09","00","(All)","0900","0900 - (All)"]
[null,null,null,null,null,null,null,null,null,null,null,null,null,null,"000002524","PAMPACAMARA                                                                                         ","01","15",12,"05","0115","000002524 - PAMPACAMARA                                                                                         ",null,null,null,null,null,"09","01","SANTA ANA","0901","0901 - SANTA ANA"]
[null,null,null,null,null,null,null,null,null,null,null,null,null,null,"000002526","QUINCE MIL","01","15",12,"03","0115","000002526 - QUINCE MIL",null,null,null,null,null,"09","02","ECHARATE","0902","0902 - ECHARATE"]
[null,null,null,null,null,null,null,null,null,null,null,null,null,null,"000002527","CCARHUAYO","01","15",12,"04","0115","000002527 - CCARHUAYO",null,null,null,null,null,"09","03","HUAYOPATA","0903","0903 - HUAYOPATA"]
[null,null,null,null,null,null,null,null,null,null,null,null,null,null,"000002528","CCATCCA                                                                                             ","01","15",12,"05","0115","000002528 - CCATCCA                                                                                             ",null,null,null,null,null,"09","04","MARANURA","0904","0904 - MARANURA"]
[null,null,null,null,null,null,null,null,null,null,null,null,null,null,"000002529","KCAURY                                                                                              ","01","15",12,"05","0115","000002529 - KCAURY                                                                                              ",null,null,null,null,null,"09","05","OCOBAMBA","0905","0905 - OCOBAMBA"]
[null,null,null,null,null,null,null,null,null,null,null,null,null,null,"000002535","MARCAPATA                                                                                           ","01","15",12,"09","0115","000002535 - MARCAPATA                                                                                           ",null,null,null,null,null,"09","06","QUELLOUNO","0906","0906 - QUELLOUNO"]
[null,null,null,null,null,null,null,null,null,null,null,null,null,null,"000002536","OCONGATE                                                                                            ","01","15",12,10,"0115","000002536 - OCONGATE                                                                                            ",null,null,null,null,null,"09","07","KIMBIRI","0907","0907 - KIMBIRI"]
[null,null,null,null,null,null,null,null,null,null,null,null,null,null,"000006977","TINKI                                                                                               ","01","15",12,10,{"$f":"CONCATENATE(Q90,R90)","v":"0115"},"000006977 - TINKI                                                                                               ",null,null,null,null,null,"09","08","SANTA TERESA","0908","0908 - SANTA TERESA"]
[null,null,null,null,null,null,null,null,null,null,null,null,null,null,"000007110","INCACANCHA                                                                                          ","01","15",12,"09","0115","000007110 - INCACANCHA                                                                                          ",null,null,null,null,null,"09","09","VILCABAMBA","0909","0909 - VILCABAMBA"]
[null,null,null,null,null,null,null,null,null,null,null,null,null,null,"000012931","CHICHINA                                                                                            ","01","15",12,"05","0115","000012931 - CHICHINA                                                                                            ",null,null,null,null,null,"09","10","PICHARI","0910","0910 - PICHARI"]
[null,null,null,null,null,null,null,null,null,null,null,null,null,null,"000016335","CCAPANA                                                                                             ","01","15",12,"05","0115","000016335 - CCAPANA                                                                                             ",null,null,null,null,null,"09","11","INKAWASI                                ","0911","0911 - INKAWASI                                "]
[null,null,null,null,null,null,null,null,null,null,null,null,null,null,"999999999","(All)","01","99",null,null,"0199","999999999 - (All)",null,null,null,null,null,"09","12","VILLA VIRGEN","0912","0912 - VILLA VIRGEN"]
[null,null,null,null,null,null,null,null,null,null,null,null,null,null,"000000000","(All)","02","01",null,null,"0201","000000000 - (All)",null,null,null,null,null,"09","13","VILLA KINTIARINA","0913","0913 - VILLA KINTIARINA"]
[null,null,null,null,null,null,null,null,null,null,null,null,null,null,"000002292","INDEPENDENCIA                                                                                       ","02","01","01","01","0201","000002292 - INDEPENDENCIA                                                                                       ",null,null,null,null,null,"09","14","MEGANTONI","0914","0914 - MEGANTONI"]
[null,null,null,null,null,null,null,null,null,null,null,null,null,null,"000002297","CCORCCA                                                                                             ","02","01","01","02","0201","000002297 - CCORCCA                                                                                             ",null,null,null,null,null,"09","15","KUMPIRUSHIATO","0915","0915 - KUMPIRUSHIATO"]
[null,null,null,null,null,null,null,null,null,null,null,null,null,null,"000002306","BELEMPAMPA                                                                                          ","02","01","01","06","0201","000002306 - BELEMPAMPA                                                                                          ",null,null,null,null,null,"09","16","CIELO PUNCO","0916","0916 - CIELO PUNCO"]
[null,null,null,null,null,null,null,null,null,null,null,null,null,null,"000002308","ZARZUELA ALTA                                                                                       ","02","01","01","06","0201","000002308 - ZARZUELA ALTA                                                                                       ",null,null,null,null,null,"09","17","MANITEA","0917","0917 - MANITEA"]
[null,null,null,null,null,null,null,null,null,null,null,null,null,null,"000002309","DIGNIDAD NACIONAL                                                                                   ","02","01","01","06","0201","000002309 - DIGNIDAD NACIONAL                                                                                   ",null,null,null,null,null,"09","18","UNION ASHANINKA","0918","0918 - UNION ASHANINKA"]
[null,null,null,null,null,null,null,null,null,null,null,null,null,null,"000002313","OCCOPATA                                                                                            ","02","01","01","06","0201","000002313 - OCCOPATA                                                                                            ",null,null,null,null,null,"10","00","(All)","1000","1000 - (All)"]
[null,null,null,null,null,null,null,null,null,null,null,null,null,null,"000010067","ESSALUD-SANTIAGO","02","01","01","06","0201","000010067 - ESSALUD-SANTIAGO",null,null,null,null,null,"10","01","PARURO","1001","1001 - PARURO"]
[null,null,null,null,null,null,null,null,null,null,null,null,null,null,"000010920","EJERCITO-QUINTA BRIGADA DE MONTAÑA","02","01","01","06","0201","000010920 - EJERCITO-QUINTA BRIGADA DE MONTAÑA",null,null,null,null,null,"10","02","ACCHA","1002","1002 - ACCHA"]
[null,null,null,null,null,null,null,null,null,null,null,null,null,null,"000026182","MENTAL SANTIAGO","02","01","01","06","0201","000026182 - MENTAL SANTIAGO",null,null,null,null,null,"10","03","CCAPI","1003","1003 - CCAPI"]
[null,null,null,null,null,null,null,null,null,null,null,null,null,null,"000000000","(All)","02","02",null,null,"0202","000000000 - (All)",null,null,null,null,null,"10","04","COLCHA","1004","1004 - COLCHA"]
[null,null,null,null,null,null,null,null,null,null,null,null,null,null,"000002302","CCORAO                                                                                              ","02","02","01","05","0202","000002302 - CCORAO                                                                                              ",null,null,null,null,null,"10","05","HUANOQUITE","1005","1005 - HUANOQUITE"]
[null,null,null,null,null,null,null,null,null,null,null,null,null,null,"000002307","MANCO CAPAC","02","02","01","06","0202","000002307 - MANCO CAPAC",null,null,null,null,null,"10","06","OMACHA","1006","1006 - OMACHA"]
[null,null,null,null,null,null,null,null,null,null,null,null,null,null,"000002310","CHOCCO                                                                                              ","02","02","01","06","0202","000002310 - CHOCCO                                                                                              ",null,null,null,null,null,"10","07","PACCARITAMBO","1007","1007 - PACCARITAMBO"]
[null,null,null,null,null,null,null,null,null,null,null,null,null,null,"000002315","WANCHAQ                                                                                             ","02","02","01","08","0202","000002315 - WANCHAQ                                                                                             ",null,null,null,null,null,"10","08","PILLPINTO","1008","1008 - PILLPINTO"]
[null,null,null,null,null,null,null,null,null,null,null,null,null,null,"000002316","TTIO                                                                                                ","02","02","01","08","0202","000002316 - TTIO                                                                                                ",null,null,null,null,null,"10","09","YAURISQUE","1009","1009 - YAURISQUE"]
[null,null,null,null,null,null,null,null,null,null,null,null,null,null,"000010041","ESSALUD-ADOLFO GUEVARA V.","02","02","01","08","0202","000010041 - ESSALUD-ADOLFO GUEVARA V.",null,null,null,null,null,"11","00","(All)","1100","1100 - (All)"]
[null,null,null,null,null,null,null,null,null,null,null,null,null,null,"000026183","ESSALUD-METROPOLITANO","02","02","01","08","0202","000026183 - ESSALUD-METROPOLITANO",null,null,null,null,null,"11","01","PAUCARTAMBO","1101","1101 - PAUCARTAMBO"]
[null,null,null,null,null,null,null,null,null,null,null,null,null,null,"000030730","PATRON SANTIAGO","02","02","01","08","0202","000030730 - PATRON SANTIAGO",null,null,null,null,null,"11","02","CAICAY","1102","1102 - CAICAY"]
[null,null,null,null,null,null,null,null,null,null,null,null,null,null,"000000000","(All)","02","03",null,null,"0203","000000000 - (All)",null,null,null,null,null,"11","03","CHALLABAMBA","1103","1103 - CHALLABAMBA"]
[null,null,null,null,null,null,null,null,null,null,null,null,null,null,"000002326","ANTA                                                                                                ","02","03","03","01","0203","000002326 - ANTA                                                                                                ",null,null,null,null,null,"11","04","COLQUEPATA","1104","1104 - COLQUEPATA"]
[null,null,null,null,null,null,null,null,null,null,null,null,null,null,"000002327","CHACAN                                                                                              ","02","03","03","01","0203","000002327 - CHACAN                                                                                              ",null,null,null,null,null,"11","05","HUANCARANI","1105","1105 - HUANCARANI"]
[null,null,null,null,null,null,null,null,null,null,null,null,null,null,"000002328","COMPONE                                                                                             ","02","03","03","01","0203","000002328 - COMPONE                                                                                             ",null,null,null,null,null,"11","06","KOSÑIPATA","1106","1106 - KOSÑIPATA"]
[null,null,null,null,null,null,null,null,null,null,null,null,null,null,"000002329","CONCHACALLA                                                                                         ","02","03","03","01","0203","000002329 - CONCHACALLA                                                                                         ",null,null,null,null,null,"12","00","(All)","1200","1200 - (All)"]
[null,null,null,null,null,null,null,null,null,null,null,null,null,null,"000002330","ANCAHUASI                                                                                           ","02","03","03","02","0203","000002330 - ANCAHUASI                                                                                           ",null,null,null,null,null,"12","01","URCOS","1201","1201 - URCOS"]
[null,null,null,null,null,null,null,null,null,null,null,null,null,null,"000002331","CACHIMAYO                                                                                           ","02","03","03","03","0203","000002331 - CACHIMAYO                                                                                           ",null,null,null,null,null,"12","02","ANDAHUAYLILLAS","1202","1202 - ANDAHUAYLILLAS"]
[null,null,null,null,null,null,null,null,null,null,null,null,null,null,"000002332","CHINCHAYPUJIO                                                                                       ","02","03","03","04","0203","000002332 - CHINCHAYPUJIO                                                                                       ",null,null,null,null,null,"12","03","CAMANTI","1203","1203 - CAMANTI"]
[null,null,null,null,null,null,null,null,null,null,null,null,null,null,"000002333","HUAROCONDO                                                                                          ","02","03","03","05","0203","000002333 - HUAROCONDO                                                                                          ",null,null,null,null,null,"12","04","CCARHUAYO","1204","1204 - CCARHUAYO"]
[null,null,null,null,null,null,null,null,null,null,null,null,null,null,"000002334","HUAYLLACOCHA                                                                                        ","02","03","03","05","0203","000002334 - HUAYLLACOCHA                                                                                        ",null,null,null,null,null,"12","05","CCATCA","1205","1205 - CCATCA"]
[null,null,null,null,null,null,null,null,null,null,null,null,null,null,"000002339","PUCYURA ANTA                                                                                        ","02","03","03","08","0203","000002339 - PUCYURA ANTA                                                                                        ",null,null,null,null,null,"12","06","CUSIPATA","1206","1206 - CUSIPATA"]
[null,null,null,null,null,null,null,null,null,null,null,null,null,null,"000002340","ZURITE                                                                                              ","02","03","03","09","0203","000002340 - ZURITE                                                                                              ",null,null,null,null,null,"12","07","HUARO","1207","1207 - HUARO"]
[null,null,null,null,null,null,null,null,null,null,null,null,null,null,"000006972","PANTIPATA                                                                                           ","02","03","03","04","0203","000006972 - PANTIPATA                                                                                           ",null,null,null,null,null,"12","08","LUCRE","1208","1208 - LUCRE"]
[null,null,null,null,null,null,null,null,null,null,null,null,null,null,"000027790","MENTAL COMUNITARIO ANTA","02","03","03","01","0203","000027790 - MENTAL COMUNITARIO ANTA",null,null,null,null,null,"12","09","MARCAPATA","1209","1209 - MARCAPATA"]
[null,null,null,null,null,null,null,null,null,null,null,null,null,null,"000000000","(All)","02","04",null,null,"0204","000000000 - (All)",null,null,null,null,null,"12","10","OCONGATE","1210","1210 - OCONGATE"]
[null,null,null,null,null,null,null,null,null,null,null,null,null,null,"000002336","LIMATAMBO                                                                                           ","02","04","03","06","0204","000002336 - LIMATAMBO                                                                                           ",null,null,null,null,null,"12","11","OROPESA","1211","1211 - OROPESA"]
[null,null,null,null,null,null,null,null,null,null,null,null,null,null,"000002337","PAMPACONGA                                                                                          ","02","04","03","06","0204","000002337 - PAMPACONGA                                                                                          ",null,null,null,null,null,"12","12","QUIQUIJANA","1212","1212 - QUIQUIJANA"]
[null,null,null,null,null,null,null,null,null,null,null,null,null,null,"000002338","MOLLEPATA                                                                                           ","02","04","03","07","0204","000002338 - MOLLEPATA                                                                                           ",null,null,null,null,null,"13","00","(All)","1300","1300 - (All)"]
[null,null,null,null,null,null,null,null,null,null,null,null,null,null,"000010761","URATARI                                                                                             ","02","04","03","06","0204","000010761 - URATARI                                                                                             ",null,null,null,null,null,"13","01","URUBAMBA","1301","1301 - URUBAMBA"]
[null,null,null,null,null,null,null,null,null,null,null,null,null,null,"000021061","HUAMANPATA                                                                                          ","02","04","03","07","0204","000021061 - HUAMANPATA                                                                                          ",null,null,null,null,null,"13","02","CHINCHERO","1302","1302 - CHINCHERO"]
[null,null,null,null,null,null,null,null,null,null,null,null,null,null,"000000000","(All)","02","05",null,null,"0205","000000000 - (All)",null,null,null,null,null,"13","03","HUAYLLABAMBA","1303","1303 - HUAYLLABAMBA"]
[null,null,null,null,null,null,null,null,null,null,null,null,null,null,"000002343","COYA                                                                                                ","02","05","04","02","0205","000002343 - COYA                                                                                                ",null,null,null,null,null,"13","04","MACHUPICCHU","1304","1304 - MACHUPICCHU"]
[null,null,null,null,null,null,null,null,null,null,null,null,null,null,"000002344","LAMAY                                                                                               ","02","05","04","03","0205","000002344 - LAMAY                                                                                               ",null,null,null,null,null,"13","05","MARAS","1305","1305 - MARAS"]
[null,null,null,null,null,null,null,null,null,null,null,null,null,null,"000002348","PISAC                                                                                               ","02","05","04","05","0205","000002348 - PISAC                                                                                               ",null,null,null,null,null,"13","06","OLLANTAYTAMBO","1306","1306 - OLLANTAYTAMBO"]
[null,null,null,null,null,null,null,null,null,null,null,null,null,null,"000002349","CUYO CHICO                                                                                          ","02","05","04","05","0205","000002349 - CUYO CHICO                                                                                          ",null,null,null,null,null,"13","07","YUCAY","1307","1307 - YUCAY"]
[null,null,null,null,null,null,null,null,null,null,null,null,null,null,"000002350","CUYO GRANDE                                                                                         ","02","05","04","05","0205",{"$f":"CONCATENATE(O139,\" - \",P139)","v":"000002350 - CUYO GRANDE                                                                                         "},null,null,null,null,null,"00","00","(All)",{"$f":"CONCATENATE(AB139,AC139)","v":"0000"},{"$f":"CONCATENATE(AB139,AC139,\" - \",AD139)","v":"0000 - (All)"}]
[null,null,null,null,null,null,null,null,null,null,null,null,null,null,"000002351","QUELLO QUELLO                                                                                       ","02","05","04","05","0205","000002351 - QUELLO QUELLO                                                                                       "]
[null,null,null,null,null,null,null,null,null,null,null,null,null,null,"000002352","SAN SALVADOR                                                                                        ","02","05","04","06","0205","000002352 - SAN SALVADOR                                                                                        "]
[null,null,null,null,null,null,null,null,null,null,null,null,null,null,"000002353","TARAY                                                                                               ","02","05","04","07","0205","000002353 - TARAY                                                                                               "]
[null,null,null,null,null,null,null,null,null,null,null,null,null,null,"000002354","HUANCALLE                                                                                           ","02","05","04","07","0205","000002354 - HUANCALLE                                                                                           "]
[null,null,null,null,null,null,null,null,null,null,null,null,null,null,"000006970","TIRACANCHA                                                                                          ","02","05","04","06","0205","000006970 - TIRACANCHA                                                                                          "]
[null,null,null,null,null,null,null,null,null,null,null,null,null,null,"000006975","SAYLLAFAYA                                                                                          ","02","05","04","03","0205","000006975 - SAYLLAFAYA                                                                                          "]
[null,null,null,null,null,null,null,null,null,null,null,null,null,null,"000007145","HUAMA                                                                                               ","02","05","04","03","0205","000007145 - HUAMA                                                                                               "]
[null,null,null,null,null,null,null,null,null,null,null,null,null,null,"000007146","POQUES                                                                                              ","02","05","04","03","0205","000007146 - POQUES                                                                                              "]
[null,null,null,null,null,null,null,null,null,null,null,null,null,null,"000025368","HUARQUI","02","05","04","03","0205","000025368 - HUARQUI"]
[null,null,null,null,null,null,null,null,null,null,null,null,null,null,"000000000","(All)","02","06",null,null,"0206","000000000 - (All)"]
[null,null,null,null,null,null,null,null,null,null,null,null,null,null,"000002341","CALCA                                                                                               ","02","06","04","01","0206","000002341 - CALCA                                                                                               "]
[null,null,null,null,null,null,null,null,null,null,null,null,null,null,"000002342","AMPARAES                                                                                            ","02","06","04","04","0206","000002342 - AMPARAES                                                                                            "]
[null,null,null,null,null,null,null,null,null,null,null,null,null,null,"000002345","CCACHIN                                                                                             ","02","06","04","04","0206","000002345 - CCACHIN                                                                                             "]
[null,null,null,null,null,null,null,null,null,null,null,null,null,null,"000002346","CHOQUECANCHA                                                                                        ","02","06","04","04","0206","000002346 - CHOQUECANCHA                                                                                        "]
[null,null,null,null,null,null,null,null,null,null,null,null,null,null,"000002347","LARES                                                                                               ","02","06","04","04",{"$f":"CONCATENATE(Q154,R154)","v":"0206"},"000002347 - LARES                                                                                               "]
[null,null,null,null,null,null,null,null,null,null,null,null,null,null,"000002361","SUYO                                                                                                ","02","06","04","04","0206","000002361 - SUYO                                                                                                "]
[null,null,null,null,null,null,null,null,null,null,null,null,null,null,"000002515","PAROBAMBA                                                                                           ","02","06",11,"03","0206","000002515 - PAROBAMBA                                                                                           "]
[null,null,null,null,null,null,null,null,null,null,null,null,null,null,"000007143","OTOCANI                                                                                             ","02","06",11,"03","0206","000007143 - OTOCANI                                                                                             "]
[null,null,null,null,null,null,null,null,null,null,null,null,null,null,"000007144","PATABAMBA                                                                                           ","02","06","04","07","0206","000007144 - PATABAMBA                                                                                           "]
[null,null,null,null,null,null,null,null,null,null,null,null,null,null,"000010069","ESSALUD-CALCA","02","06","04","01","0206","000010069 - ESSALUD-CALCA"]
[null,null,null,null,null,null,null,null,null,null,null,null,null,null,"000010759","HUARAN                                                                                              ","02","06","04","01","0206","000010759 - HUARAN                                                                                              "]
[null,null,null,null,null,null,null,null,null,null,null,null,null,null,"000010762","ACCHA ALTA - PAMPALLACTA                                                                            ","02","06","04","01","0206","000010762 - ACCHA ALTA - PAMPALLACTA                                                                            "]
[null,null,null,null,null,null,null,null,null,null,null,null,null,null,"000026273","MENTAL COMUNITARIO CALCA","02","06","04","01","0206","000026273 - MENTAL COMUNITARIO CALCA"]
[null,null,null,null,null,null,null,null,null,null,null,null,null,null,"000000000","(All)","02","07",null,null,"0207","000000000 - (All)"]
[null,null,null,null,null,null,null,null,null,null,null,null,null,null,"000002540","URUBAMBA                                                                                            ","02","07",13,"01","0207","000002540 - URUBAMBA                                                                                            "]
[null,null,null,null,null,null,null,null,null,null,null,null,null,null,"000002541","YANAHUARA                                                                                           ","02","07",13,"01","0207","000002541 - YANAHUARA                                                                                           "]
[null,null,null,null,null,null,null,null,null,null,null,null,null,null,"000002543","CHINCHERO                                                                                           ","02","07",13,"02","0207","000002543 - CHINCHERO                                                                                           "]
[null,null,null,null,null,null,null,null,null,null,null,null,null,null,"000002544","OCCOTUAN                                                                                            ","02","07",13,"02","0207","000002544 - OCCOTUAN                                                                                            "]
[null,null,null,null,null,null,null,null,null,null,null,null,null,null,"000002545","HUAYLLABAMBA                                                                                        ","02","07",13,"03","0207","000002545 - HUAYLLABAMBA                                                                                        "]
[null,null,null,null,null,null,null,null,null,null,null,null,null,null,"000002546","MACHUPICCHU                                                                                         ","02","07",13,"04","0207","000002546 - MACHUPICCHU                                                                                         "]
[null,null,null,null,null,null,null,null,null,null,null,null,null,null,"000002547","COLLPANI                                                                                            ","02","07",13,"04","0207","000002547 - COLLPANI                                                                                            "]
[null,null,null,null,null,null,null,null,null,null,null,null,null,null,"000002548","MARAS                                                                                               ","02","07",13,"05","0207","000002548 - MARAS                                                                                               "]
[null,null,null,null,null,null,null,null,null,null,null,null,null,null,"000002549","OLLANTAYTAMBO                                                                                       ","02","07",13,"06","0207","000002549 - OLLANTAYTAMBO                                                                                       "]
[null,null,null,null,null,null,null,null,null,null,null,null,null,null,"000002550","CHILLCA                                                                                            ","02","07",13,"06","0207","000002550 - CHILLCA                                                                                            "]
[null,null,null,null,null,null,null,null,null,null,null,null,null,null,"000002551","YUCAY                                                                                               ","02","07",13,"07","0207","000002551 - YUCAY                                                                                               "]
[null,null,null,null,null,null,null,null,null,null,null,null,null,null,"000006974","CAMINO INCA HUAYLLABAMBA                                                                            ","02","07",13,"04","0207","000006974 - CAMINO INCA HUAYLLABAMBA                                                                            "]
[null,null,null,null,null,null,null,null,null,null,null,null,null,null,"000010060","ESSALUD-URUBAMBA","02","07",13,"01","0207","000010060 - ESSALUD-URUBAMBA"]
[null,null,null,null,null,null,null,null,null,null,null,null,null,null,"000010073","ESSALUD-MACHU PICCHU","02","07",13,"04","0207","000010073 - ESSALUD-MACHU PICCHU"]
[null,null,null,null,null,null,null,null,null,null,null,null,null,null,"000010758","CRUZPATA                                                                                            ","02","07",13,"05","0207","000010758 - CRUZPATA                                                                                            "]
[null,null,null,null,null,null,null,null,null,null,null,null,null,null,"000010760","PATACANCHA                                                                                          ","02","07",13,"06","0207","000010760 - PATACANCHA                                                                                          "]
[null,null,null,null,null,null,null,null,null,null,null,null,null,null,"000030666","MENTAL COMUNITARIO URUBAMBA","02","07",13,"01","0207","000030666 - MENTAL COMUNITARIO URUBAMBA"]
[null,null,null,null,null,null,null,null,null,null,null,null,null,null,"000000000","(All)","02","08",null,null,"0208","000000000 - (All)"]
[null,null,null,null,null,null,null,null,null,null,null,null,null,null,"000002355","LA QUEBRADA                                                                                         ","02","08","04","08","0208","000002355 - LA QUEBRADA                                                                                         "]
[null,null,null,null,null,null,null,null,null,null,null,null,null,null,"000002356","CCORIMAYO                                                                                           ","02","08","04","08","0208","000002356 - CCORIMAYO                                                                                           "]
[null,null,null,null,null,null,null,null,null,null,null,null,null,null,"000002357","COLCCA YANATILE                                                                                     ","02","08","04","08","0208","000002357 - COLCCA YANATILE                                                                                     "]
[null,null,null,null,null,null,null,null,null,null,null,null,null,null,"000002358","MUYUPAY                                                                                             ","02","08","04","08","0208","000002358 - MUYUPAY                                                                                             "]
[null,null,null,null,null,null,null,null,null,null,null,null,null,null,"000002359","PUTUCUSI                                                                                            ","02","08","04","08","0208","000002359 - PUTUCUSI                                                                                            "]
[null,null,null,null,null,null,null,null,null,null,null,null,null,null,"000002360","QUESQUENTO                                                                                          ","02","08","04","08","0208","000002360 - QUESQUENTO                                                                                          "]
[null,null,null,null,null,null,null,null,null,null,null,null,null,null,"000002362","HUACHIBAMBA                                                                                         ","02","08","04","08","0208","000002362 - HUACHIBAMBA                                                                                         "]
[null,null,null,null,null,null,null,null,null,null,null,null,null,null,"000002464","VERSALLES                                                                                           ","02","08","09","05","0208","000002464 - VERSALLES                                                                                           "]
[null,null,null,null,null,null,null,null,null,null,null,null,null,null,"000002467","PUENTE SANTIAGO                                                                                     ","02","08","09","06","0208","000002467 - PUENTE SANTIAGO                                                                                     "]
[null,null,null,null,null,null,null,null,null,null,null,null,null,null,"000006971","COMBAPATA YANATILE                                                                                  ","02","08","04","08","0208","000006971 - COMBAPATA YANATILE                                                                                  "]
[null,null,null,null,null,null,null,null,null,null,null,null,null,null,"000006973","BELLAVISTA                                                                                          ","02","08","04","08","0208","000006973 - BELLAVISTA                                                                                          "]
[null,null,null,null,null,null,null,null,null,null,null,null,null,null,"000007142","CHANCAMAYO                                                                                          ","02","08","04","08","0208","000007142 - CHANCAMAYO                                                                                          "]
[null,null,null,null,null,null,null,null,null,null,null,null,null,null,"000000000","(All)","02","09",null,null,"0209","000000000 - (All)"]
[null,null,null,null,null,null,null,null,null,null,null,null,null,null,"000002290","SAN PEDRO CUSCO                                                                                     ","02","09","01","01","0209","000002290 - SAN PEDRO CUSCO                                                                                     "]
[null,null,null,null,null,null,null,null,null,null,null,null,null,null,"000002291","SIETE CUARTONES                                                                                     ","02","09","01","01","0209","000002291 - SIETE CUARTONES                                                                                     "]
[null,null,null,null,null,null,null,null,null,null,null,null,null,null,"000002293","MIRAFLORES                                                                                          ","02","09","01","01","0209","000002293 - MIRAFLORES                                                                                          "]
[null,null,null,null,null,null,null,null,null,null,null,null,null,null,"000002294","PICCHU LA RINCONADA                                                                                 ","02","09","01","01","0209","000002294 - PICCHU LA RINCONADA                                                                                 "]
[null,null,null,null,null,null,null,null,null,null,null,null,null,null,"000002295","BUENA VISTA                                                                                         ","02","09","01","01","0209","000002295 - BUENA VISTA                                                                                         "]
[null,null,null,null,null,null,null,null,null,null,null,null,null,null,"000002299","POROY                                                                                               ","02","09","01","03","0209","000002299 - POROY                                                                                               "]
[null,null,null,null,null,null,null,null,null,null,null,null,null,null,"999999999","(All)","02","99",null,null,"0299","999999999 - (All)"]
[null,null,null,null,null,null,null,null,null,null,null,null,null,null,"000002421","HOSPITAL QUILLABAMBA","03","00","09","01",{"$f":"CONCATENATE(Q202,R202)","v":"0300"},{"$f":"CONCATENATE(O202,\" - \",P202)","v":"000002421 - HOSPITAL QUILLABAMBA"}]
[null,null,null,null,null,null,null,null,null,null,null,null,null,null,"000000000","(All)","03","01",null,null,{"$f":"CONCATENATE(Q203,R203)","v":"0301"},{"$f":"CONCATENATE(O203,\" - \",P203)","v":"000000000 - (All)"}]
[null,null,null,null,null,null,null,null,null,null,null,null,null,null,"000002422","HUAYANAY                                                                                            ","03","01","09","01",{"$f":"CONCATENATE(Q204,R204)","v":"0301"},{"$f":"CONCATENATE(O204,\" - \",P204)","v":"000002422 - HUAYANAY                                                                                            "}]
[null,null,null,null,null,null,null,null,null,null,null,null,null,null,"000002423","IDMA                                                                                                ","03","01","09","01","0301",{"$f":"CONCATENATE(O205,\" - \",P205)","v":"000002423 - IDMA                                                                                                "}]
[null,null,null,null,null,null,null,null,null,null,null,null,null,null,"000002424","POTRERO                                                                                             ","03","01","09","01","0301",{"$f":"CONCATENATE(O206,\" - \",P206)","v":"000002424 - POTRERO                                                                                             "}]
[null,null,null,null,null,null,null,null,null,null,null,null,null,null,"000002425","ECHARATE                                                                                            ","03","01","09","02","0301","000002425 - ECHARATE                                                                                            "]
[null,null,null,null,null,null,null,null,null,null,null,null,null,null,"000002429","CIRIALO                                                                                             ","03","01","09","02","0301","000002429 - CIRIALO                                                                                             "]
[null,null,null,null,null,null,null,null,null,null,null,null,null,null,"000002430","PAMPA CONCEPCION                                                                                    ","03","01","09","02","0301","000002430 - PAMPA CONCEPCION                                                                                    "]
[null,null,null,null,null,null,null,null,null,null,null,null,null,null,"000002433","KORIBENI                                                                                            ","03","01","09","02","0301","000002433 - KORIBENI                                                                                            "]
[null,null,null,null,null,null,null,null,null,null,null,null,null,null,"000002439","PALMA REAL                                                                                          ","03","01","09","02","0301","000002439 - PALMA REAL                                                                                          "]
[null,null,null,null,null,null,null,null,null,null,null,null,null,null,"000002446","CHACCO                                                                                              ","03","01","09","02","0301","000002446 - CHACCO                                                                                              "]
[null,null,null,null,null,null,null,null,null,null,null,null,null,null,"000002449","ICHIQUIATO                                                                                          ","03","01","09","02","0301","000002449 - ICHIQUIATO                                                                                          "]
[null,null,null,null,null,null,null,null,null,null,null,null,null,null,"000002450","SAN ANTONIO                                                                                         ","03","01","09","02","0301","000002450 - SAN ANTONIO                                                                                         "]
[null,null,null,null,null,null,null,null,null,null,null,null,null,null,"000002451","CHAHUARES                                                                                           ","03","01","09","02","0301","000002451 - CHAHUARES                                                                                           "]
[null,null,null,null,null,null,null,null,null,null,null,null,null,null,"000008910","SANTA ANA                                                                                           ","03","01","09","01","0301","000008910 - SANTA ANA                                                                                           "]
[null,null,null,null,null,null,null,null,null,null,null,null,null,null,"000010062","ESSALUD-QUILLABAMBA","03","01","09","01","0301","000010062 - ESSALUD-QUILLABAMBA"]
[null,null,null,null,null,null,null,null,null,null,null,null,null,null,"000011744","SANIDAD-QUILLABAMBA PNP","03","01","09","01","0301","000011744 - SANIDAD-QUILLABAMBA PNP"]
[null,null,null,null,null,null,null,null,null,null,null,null,null,null,"000015842","PAVAYOC                                                                                             ","03","01","09","01","0301","000015842 - PAVAYOC                                                                                             "]
[null,null,null,null,null,null,null,null,null,null,null,null,null,null,"000023721","EJERCITO-PERUANO","03","01","09","01","0301","000023721 - EJERCITO-PERUANO"]
[null,null,null,null,null,null,null,null,null,null,null,null,null,null,"000026386","MENTAL QUILLABAMBA","03","01","09","01","0301","000026386 - MENTAL QUILLABAMBA"]
[null,null,null,null,null,null,null,null,null,null,null,null,null,null,"000033273","SAN ISIDRO LABRADOR - ECHARATI","03","01","09","02","0301","000033273 - SAN ISIDRO LABRADOR - ECHARATI"]
[null,null,null,null,null,null,null,null,null,null,null,null,null,null,"000000000","(All)","03","02",null,null,"0302","000000000 - (All)"]
[null,null,null,null,null,null,null,null,null,null,null,null,null,null,"000002453","HUYRO                                                                                               ","03","02","09","03","0302","000002453 - HUYRO                                                                                               "]
[null,null,null,null,null,null,null,null,null,null,null,null,null,null,"000002454","ALFAMAYO                                                                                            ","03","02","09","03","0302","000002454 - ALFAMAYO                                                                                            "]
[null,null,null,null,null,null,null,null,null,null,null,null,null,null,"000002455","HUAYOPATA                                                                                           ","03","02","09","03","0302","000002455 - HUAYOPATA                                                                                           "]
[null,null,null,null,null,null,null,null,null,null,null,null,null,null,"000002456","AMAYBAMBA                                                                                           ","03","02","09","03","0302","000002456 - AMAYBAMBA                                                                                           "]
[null,null,null,null,null,null,null,null,null,null,null,null,null,null,"000002457","SAN PABLO HUAYOPATA                                                                                 ","03","02","09","03","0302","000002457 - SAN PABLO HUAYOPATA                                                                                 "]
[null,null,null,null,null,null,null,null,null,null,null,null,null,null,"000002458","MARANURA                                                                                            ","03","02","09","04","0302","000002458 - MARANURA                                                                                            "]
[null,null,null,null,null,null,null,null,null,null,null,null,null,null,"000002460","SANTA MARIA                                                                                         ","03","02","09","04","0302","000002460 - SANTA MARIA                                                                                         "]
[null,null,null,null,null,null,null,null,null,null,null,null,null,null,"000002461","UCHUMAYO                                                                                            ","03","02","09","04","0302","000002461 - UCHUMAYO                                                                                            "]
[null,null,null,null,null,null,null,null,null,null,null,null,null,null,"000002476","SANTA TERESA                                                                                        ","03","02","09","08","0302","000002476 - SANTA TERESA                                                                                        "]
[null,null,null,null,null,null,null,null,null,null,null,null,null,null,"000002477","SULLUCUYOC                                                                                          ","03","02","09","08","0302","000002477 - SULLUCUYOC                                                                                          "]
[null,null,null,null,null,null,null,null,null,null,null,null,null,null,"000002478","TOTORA                                                                                              ","03","02","09","08","0302","000002478 - TOTORA                                                                                              "]
[null,null,null,null,null,null,null,null,null,null,null,null,null,null,"000010075","ESSALUD-HUYRO","03","02","09","03","0302","000010075 - ESSALUD-HUYRO"]
[null,null,null,null,null,null,null,null,null,null,null,null,null,null,"000000000","(All)","03","03",null,null,"0303","000000000 - (All)"]
[null,null,null,null,null,null,null,null,null,null,null,null,null,null,"000002363","TUPAC AMARU QUELLOUNO                                                                               ","03","03","04","08","0303","000002363 - TUPAC AMARU QUELLOUNO                                                                               "]
[null,null,null,null,null,null,null,null,null,null,null,null,null,null,"000002462","OCCOBAMBA LACONVENCION                                                                              ","03","03","09","05","0303","000002462 - OCCOBAMBA LACONVENCION                                                                              "]
[null,null,null,null,null,null,null,null,null,null,null,null,null,null,"000002463","CHINGANILLA                                                                                         ","03","03","09","05","0303","000002463 - CHINGANILLA                                                                                         "]
[null,null,null,null,null,null,null,null,null,null,null,null,null,null,"000002465","QUELLOUNO                                                                                           ","03","03","09","06","0303","000002465 - QUELLOUNO                                                                                           "]
[null,null,null,null,null,null,null,null,null,null,null,null,null,null,"000002466","HUILLCAPAMPA                                                                                        ","03","03","09","06","0303","000002466 - HUILLCAPAMPA                                                                                        "]
[null,null,null,null,null,null,null,null,null,null,null,null,null,null,"000002468","SAN MARTIN                                                                                          ","03","03","09","06","0303","000002468 - SAN MARTIN                                                                                          "]
[null,null,null,null,null,null,null,null,null,null,null,null,null,null,"000008906","ESTRELLA                                                                                            ","03","03","09","06","0303","000008906 - ESTRELLA                                                                                            "]
[null,null,null,null,null,null,null,null,null,null,null,null,null,null,"000008907","MATORIATO                                                                                           ","03","03","09","06","0303","000008907 - MATORIATO                                                                                           "]
[null,null,null,null,null,null,null,null,null,null,null,null,null,null,"000008908","CHIRUMBIA                                                                                           ","03","03","09","06","0303","000008908 - CHIRUMBIA                                                                                           "]
[null,null,null,null,null,null,null,null,null,null,null,null,null,null,"000008909","CHAPO BOYERO                                                                                        ","03","03","09","06","0303","000008909 - CHAPO BOYERO                                                                                        "]
[null,null,null,null,null,null,null,null,null,null,null,null,null,null,"000000000","(All)","03","04",null,null,"0304","000000000 - (All)"]
[null,null,null,null,null,null,null,null,null,null,null,null,null,null,"000002427","KITENI                                                                                              ","03","04","09","02","0304","000002427 - KITENI                                                                                              "]
[null,null,null,null,null,null,null,null,null,null,null,null,null,null,"000002431","IVOCHOTE                                                                                            ","03","04","09","02","0304","000002431 - IVOCHOTE                                                                                            "]
[null,null,null,null,null,null,null,null,null,null,null,null,null,null,"000002432","KEPASHIATO                                                                                          ","03","04","09","15","0304","000002432 - KEPASHIATO                                                                                          "]
[null,null,null,null,null,null,null,null,null,null,null,null,null,null,"000002434","MATERIATO                                                                                           ","03","04","09","15","0304","000002434 - MATERIATO                                                                                           "]
[null,null,null,null,null,null,null,null,null,null,null,null,null,null,"000002438","PACHIRI                                                                                             ","03","04","09","02","0304","000002438 - PACHIRI                                                                                             "]
[null,null,null,null,null,null,null,null,null,null,null,null,null,null,"000002440","PANGOA                                                                                              ","03","04","09","02","0304","000002440 - PANGOA                                                                                              "]
[null,null,null,null,null,null,null,null,null,null,null,null,null,null,"000002443","SANIRIATO                                                                                           ","03","04","09","02","0304","000002443 - SANIRIATO                                                                                           "]
[null,null,null,null,null,null,null,null,null,null,null,null,null,null,"000002447","KAMANQUIRIATO                                                                                       ","03","04","09","02","0304","000002447 - KAMANQUIRIATO                                                                                       "]
[null,null,null,null,null,null,null,null,null,null,null,null,null,null,"000002489","YUVENI                                                                                              ","03","04","09","09","0304","000002489 - YUVENI                                                                                              "]
[null,null,null,null,null,null,null,null,null,null,null,null,null,null,"000002493","SELVA ALEGRE                                                                                        ","03","04","09","09","0304","000002493 - SELVA ALEGRE                                                                                        "]
[null,null,null,null,null,null,null,null,null,null,null,null,null,null,"000006976","CHONTABAMBA                                                                                         ","03","04","09","09","0304","000006976 - CHONTABAMBA                                                                                         "]
[null,null,null,null,null,null,null,null,null,null,null,null,null,null,"000013068","TRIO RIO                                                                                            ","03","04","09","15","0304","000013068 - TRIO RIO                                                                                            "]
[null,null,null,null,null,null,null,null,null,null,null,null,null,null,"000013069","PUGUIENTIMARI                                                                                       ","03","04","09","15","0304","000013069 - PUGUIENTIMARI                                                                                       "]
[null,null,null,null,null,null,null,null,null,null,null,null,null,null,"000014531","ESSALUD-ECHARATE/KITENI","03","04","09","02","0304","000014531 - ESSALUD-ECHARATE/KITENI"]
[null,null,null,null,null,null,null,null,null,null,null,null,null,null,"000024583","EJERCITO-KEPASHIATO 314","03","04","09","02","0304","000024583 - EJERCITO-KEPASHIATO 314"]
[null,null,null,null,null,null,null,null,null,null,null,null,null,null,"000024296","EJERCITO-MIARIA 334","03","04","09","02","0304","000024296 - EJERCITO-MIARIA 334"]
[null,null,null,null,null,null,null,null,null,null,null,null,null,null,"000000000","(All)","03","05",null,null,"0305","000000000 - (All)"]
[null,null,null,null,null,null,null,null,null,null,null,null,null,null,"000002426","KIRIGUETI                                                                                           ","03","05","09","14","0305","000002426 - KIRIGUETI                                                                                           "]
[null,null,null,null,null,null,null,null,null,null,null,null,null,null,"000002428","CHOCORIARI                                                                                          ","03","05","09","14","0305","000002428 - CHOCORIARI                                                                                          "]
[null,null,null,null,null,null,null,null,null,null,null,null,null,null,"000002435","MIARIA                                                                                              ","03","05","09","14","0305","000002435 - MIARIA                                                                                              "]
[null,null,null,null,null,null,null,null,null,null,null,null,null,null,"000002436","NUEVA LUZ                                                                                           ","03","05","09","14",{"$f":"CONCATENATE(Q268,R268)","v":"0305"},"000002436 - NUEVA LUZ                                                                                           "]
[null,null,null,null,null,null,null,null,null,null,null,null,null,null,"000002437","NUEVO MUNDO                                                                                         ","03","05","09","14","0305","000002437 - NUEVO MUNDO                                                                                         "]
[null,null,null,null,null,null,null,null,null,null,null,null,null,null,"000002441","PUERTO HUALLANA                                                                                     ","03","05","09","14","0305",{"$f":"CONCATENATE(O270,\" - \",P270)","v":"000002441 - PUERTO HUALLANA                                                                                     "}]
[null,null,null,null,null,null,null,null,null,null,null,null,null,null,"000002442","PUERTO RICO                                                                                         ","03","05","09","14","0305","000002442 - PUERTO RICO                                                                                         "]
[null,null,null,null,null,null,null,null,null,null,null,null,null,null,"000002444","SENSA                                                                                               ","03","05","09","14","0305","000002444 - SENSA                                                                                               "]
[null,null,null,null,null,null,null,null,null,null,null,null,null,null,"000002445","TIMPIA                                                                                              ","03","05","09","14","0305","000002445 - TIMPIA                                                                                              "]
[null,null,null,null,null,null,null,null,null,null,null,null,null,null,"000002448","KAMISEA                                                                                             ","03","05","09","14","0305","000002448 - KAMISEA                                                                                             "]
[null,null,null,null,null,null,null,null,null,null,null,null,null,null,"000002452","SHIVANKORENI                                                                                        ","03","05","09","14","0305","000002452 - SHIVANKORENI                                                                                        "]
[null,null,null,null,null,null,null,null,null,null,null,null,null,null,"000013066","MONTETONI                                                                                           ","03","05","09","14","0305","000013066 - MONTETONI                                                                                           "]
[null,null,null,null,null,null,null,null,null,null,null,null,null,null,"000013067","TANGOSHIARI                                                                                         ","03","05","09","14","0305","000013067 - TANGOSHIARI                                                                                         "]
[null,null,null,null,null,null,null,null,null,null,null,null,null,null,"000015235","NUEVA VIDA                                                                                          ","03","05","09","14","0305","000015235 - NUEVA VIDA                                                                                          "]
[null,null,null,null,null,null,null,null,null,null,null,null,null,null,"000015843","CASHIRIARI                                                                                          ","03","05","09","14","0305","000015843 - CASHIRIARI                                                                                          "]
[null,null,null,null,null,null,null,null,null,null,null,null,null,null,"000015844","CAMANA                                                                                              ","03","05","09","14","0305","000015844 - CAMANA                                                                                              "]
[null,null,null,null,null,null,null,null,null,null,null,null,null,null,"000000000","(All)","03","06",null,null,"0306","000000000 - (All)"]
[null,null,null,null,null,null,null,null,null,null,null,null,null,null,"000002480","PUCYURA                                                                                             ","03","06","09","09","0306","000002480 - PUCYURA                                                                                             "]
[null,null,null,null,null,null,null,null,null,null,null,null,null,null,"000002481","CCARCCO                                                                                             ","03","06","09",11,"0306","000002481 - CCARCCO                                                                                             "]
[null,null,null,null,null,null,null,null,null,null,null,null,null,null,"000002482","INCAHUASI                                                                                           ","03","06","09",11,"0306","000002482 - INCAHUASI                                                                                           "]
[null,null,null,null,null,null,null,null,null,null,null,null,null,null,"000002484","OYARA                                                                                               ","03","06","09","09","0306","000002484 - OYARA                                                                                               "]
[null,null,null,null,null,null,null,null,null,null,null,null,null,null,"000002485","PACCAYBAMBA                                                                                         ","03","06","09",11,"0306","000002485 - PACCAYBAMBA                                                                                         "]
[null,null,null,null,null,null,null,null,null,null,null,null,null,null,"000002486","PAMPACONAS                                                                                          ","03","06","09","09","0306","000002486 - PAMPACONAS                                                                                          "]
[null,null,null,null,null,null,null,null,null,null,null,null,null,null,"000002487","CHOQUETIRA                                                                                          ","03","06","09",11,"0306","000002487 - CHOQUETIRA                                                                                          "]
[null,null,null,null,null,null,null,null,null,null,null,null,null,null,"000002490","ARMA                                                                                                ","03","06","09","09","0306","000002490 - ARMA                                                                                                "]
[null,null,null,null,null,null,null,null,null,null,null,null,null,null,"000002491","LUCMAHUAYCO                                                                                         ","03","06","09",11,"0306","000002491 - LUCMAHUAYCO                                                                                         "]
[null,null,null,null,null,null,null,null,null,null,null,null,null,null,"000002492","PALTAYBAMBA                                                                                         ","03","06","09","09","0306","000002492 - PALTAYBAMBA                                                                                         "]
[null,null,null,null,null,null,null,null,null,null,null,null,null,null,"000013070","CHANCAVINE                                                                                          ","03","06","09",12,"0306","000013070 - CHANCAVINE                                                                                          "]
[null,null,null,null,null,null,null,null,null,null,null,null,null,null,"000024637","EJERCITO-INCAHUASI 331                                                                                       ","03","06","09",11,"0306","000024637 - EJERCITO-INCAHUASI 331                                                                                       "]
[null,null,null,null,null,null,null,null,null,null,null,null,null,null,"999999999","(All)","03","99",null,null,"0399","999999999 - (All)"]
[null,null,null,null,null,null,null,null,null,null,null,null,null,null,"000002378","HOSPITAL SICUANI","04","00","06","01","0400","000002378 - HOSPITAL SICUANI"]
[null,null,null,null,null,null,null,null,null,null,null,null,null,null,"000007135","HOSPITAL ESPINAR","04","00","08","01","0400","000007135 - HOSPITAL ESPINAR"]
[null,null,null,null,null,null,null,null,null,null,null,null,null,null,"000000000","(All)","04","01",null,null,"0401","000000000 - (All)"]
[null,null,null,null,null,null,null,null,null,null,null,null,null,null,"000002364","YANAOCA                                                                                             ","04","01","05","01","0401","000002364 - YANAOCA                                                                                             "]
[null,null,null,null,null,null,null,null,null,null,null,null,null,null,"000002365","PONGOÑA                                                                                             ","04","01","05","01","0401","000002365 - PONGOÑA                                                                                             "]
[null,null,null,null,null,null,null,null,null,null,null,null,null,null,"000002372","PAMPAMARCA                                                                                          ","04","01","05","06","0401","000002372 - PAMPAMARCA                                                                                          "]
[null,null,null,null,null,null,null,null,null,null,null,null,null,null,"000002373","QUEHUE                                                                                              ","04","01","05","07","0401","000002373 - QUEHUE                                                                                              "]
[null,null,null,null,null,null,null,null,null,null,null,null,null,null,"000002374","HUINCHIRI                                                                                           ","04","01","05","07","0401","000002374 - HUINCHIRI                                                                                           "]
[null,null,null,null,null,null,null,null,null,null,null,null,null,null,"000002375","SURIMANA                                                                                            ","04","01","05","08","0401","000002375 - SURIMANA                                                                                            "]
[null,null,null,null,null,null,null,null,null,null,null,null,null,null,"000002376","TUNGASUCA                                                                                           ","04","01","05","08","0401","000002376 - TUNGASUCA                                                                                           "]
[null,null,null,null,null,null,null,null,null,null,null,null,null,null,"000002377","TOCCOCCORI                                                                                          ","04","01","05","08","0401","000002377 - TOCCOCCORI                                                                                          "]
[null,null,null,null,null,null,null,null,null,null,null,null,null,null,"000018241","HAMPATURA                                                                                           ","04","01","05","01","0401","000018241 - HAMPATURA                                                                                           "]
[null,null,null,null,null,null,null,null,null,null,null,null,null,null,"000032339","CCOCHAPATA                                                                                     ","04","01","05","08","0401","000032339 - CCOCHAPATA                                                                                     "]
[null,null,null,null,null,null,null,null,null,null,null,null,null,null,"000000000","(All)","04","02",null,null,"0402","000000000 - (All)"]
[null,null,null,null,null,null,null,null,null,null,null,null,null,null,"000002366","CHECCA                                                                                              ","04","02","05","02","0402","000002366 - CHECCA                                                                                              "]
[null,null,null,null,null,null,null,null,null,null,null,null,null,null,"000002367","CHITIBAMBA                                                                                          ","04","02","05","02","0402","000002367 - CHITIBAMBA                                                                                          "]
[null,null,null,null,null,null,null,null,null,null,null,null,null,null,"000007700","EL DESCANSO                                                                                         ","04","02","05","03","0402","000007700 - EL DESCANSO                                                                                         "]
[null,null,null,null,null,null,null,null,null,null,null,null,null,null,"000000000","(All)","04","03",null,null,"0403","000000000 - (All)"]
[null,null,null,null,null,null,null,null,null,null,null,null,null,null,"000002320","MOSOCLLACTA                                                                                         ","04","03","02","04","0403","000002320 - MOSOCLLACTA                                                                                         "]
[null,null,null,null,null,null,null,null,null,null,null,null,null,null,"000002385","CHECACUPE                                                                                           ","04","03","06","02","0403","000002385 - CHECACUPE                                                                                           "]
[null,null,null,null,null,null,null,null,null,null,null,null,null,null,"000002386","COMBAPATA CANCHIS                                                                                   ","04","03","06","03","0403","000002386 - COMBAPATA CANCHIS                                                                                   "]
[null,null,null,null,null,null,null,null,null,null,null,null,null,null,"000002387","CHIARA                                                                                              ","04","03","06","03","0403","000002387 - CHIARA                                                                                              "]
[null,null,null,null,null,null,null,null,null,null,null,null,null,null,"000002392","PITUMARCA                                                                                           ","04","03","06","05","0403","000002392 - PITUMARCA                                                                                           "]
[null,null,null,null,null,null,null,null,null,null,null,null,null,null,"000002397","TINTA                                                                                               ","04","03","06","08","0403","000002397 - TINTA                                                                                               "]
[null,null,null,null,null,null,null,null,null,null,null,null,null,null,"000000000","(All)","04","04",null,null,"0404","000000000 - (All)"]
[null,null,null,null,null,null,null,null,null,null,null,null,null,null,"000002369","LANGUI                                                                                              ","04","04","05","04","0404","000002369 - LANGUI                                                                                              "]
[null,null,null,null,null,null,null,null,null,null,null,null,null,null,"000002370","CONDEVILUYO                                                                                         ","04","04","05","04","0404","000002370 - CONDEVILUYO                                                                                         "]
[null,null,null,null,null,null,null,null,null,null,null,null,null,null,"000002371","LAYO                                                                                                ","04","04","05","05","0404","000002371 - LAYO                                                                                                "]
[null,null,null,null,null,null,null,null,null,null,null,null,null,null,"000002379","HERCCA                                                                                              ","04","04","06","01","0404","000002379 - HERCCA                                                                                              "]
[null,null,null,null,null,null,null,null,null,null,null,null,null,null,"000002380","TECHO OBRERO                                                                                        ","04","04","06","01","0404","000002380 - TECHO OBRERO                                                                                        "]
[null,null,null,null,null,null,null,null,null,null,null,null,null,null,"000002388","MARANGANI                                                                                           ","04","04","06","04","0404","000002388 - MARANGANI                                                                                           "]
[null,null,null,null,null,null,null,null,null,null,null,null,null,null,"000002389","CHECTUYOC                                                                                           ","04","04","06","04","0404","000002389 - CHECTUYOC                                                                                           "]
[null,null,null,null,null,null,null,null,null,null,null,null,null,null,"000002390","CCUYO                                                                                               ","04","04","06","04","0404","000002390 - CCUYO                                                                                               "]
[null,null,null,null,null,null,null,null,null,null,null,null,null,null,"000002391","OCCOBAMBA MARANGANI                                                                                 ","04","04","06","04","0404","000002391 - OCCOBAMBA MARANGANI                                                                                 "]
[null,null,null,null,null,null,null,null,null,null,null,null,null,null,"000010063","ESSALUD-SICUANI","04","04","06","01","0404","000010063 - ESSALUD-SICUANI"]
[null,null,null,null,null,null,null,null,null,null,null,null,null,null,"000024663","SANIDAD-SICUANI PNP","04","04","06","01","0404","000024663 - SANIDAD-SICUANI PNP"]
[null,null,null,null,null,null,null,null,null,null,null,null,null,null,"000000000","(All)","04","05",null,null,"0405","000000000 - (All)"]
[null,null,null,null,null,null,null,null,null,null,null,null,null,null,"000002381","QUEHUAR                                                                                             ","04","05","06","01",{"$f":"CONCATENATE(Q332,R332)","v":"0405"},"000002381 - QUEHUAR                                                                                             "]
[null,null,null,null,null,null,null,null,null,null,null,null,null,null,"000002382","UZCUPATA                                                                                            ","04","05","06","01","0405","000002382 - UZCUPATA                                                                                            "]
[null,null,null,null,null,null,null,null,null,null,null,null,null,null,"000002383","LA FLORIDA                                                                                          ","04","05","06","01","0405",{"$f":"CONCATENATE(O334,\" - \",P334)","v":"000002383 - LA FLORIDA                                                                                          "}]
[null,null,null,null,null,null,null,null,null,null,null,null,null,null,"000002384","PAMPAPHALLA                                                                                         ","04","05","06","01","0405","000002384 - PAMPAPHALLA                                                                                         "]
[null,null,null,null,null,null,null,null,null,null,null,null,null,null,"000002393","PHINAYA                                                                                             ","04","05","06","05","0405","000002393 - PHINAYA                                                                                             "]
[null,null,null,null,null,null,null,null,null,null,null,null,null,null,"000002394","SAN PABLO CANCHIS                                                                                   ","04","05","06","06","0405","000002394 - SAN PABLO CANCHIS                                                                                   "]
[null,null,null,null,null,null,null,null,null,null,null,null,null,null,"000002395","SANTA BARBARA                                                                                       ","04","05","06","06","0405","000002395 - SANTA BARBARA                                                                                       "]
[null,null,null,null,null,null,null,null,null,null,null,null,null,null,"000002396","SAN PEDRO CANCHIS                                                                                   ","04","05","06","07","0405","000002396 - SAN PEDRO CANCHIS                                                                                   "]
[null,null,null,null,null,null,null,null,null,null,null,null,null,null,"000026387","MENTAL COMUNITARIO SICUANI","04","05","06","01","0405","000026387 - MENTAL COMUNITARIO SICUANI"]
[null,null,null,null,null,null,null,null,null,null,null,null,null,null,"000000000","(All)","04","06",null,null,"0406","000000000 - (All)"]
[null,null,null,null,null,null,null,null,null,null,null,null,null,null,"000002410","YAURI                                                                                               ","04","06","08","01","0406","000002410 - YAURI                                                                                               "]
[null,null,null,null,null,null,null,null,null,null,null,null,null,null,"000002411","CONDOROMA                                                                                           ","04","06","08","02","0406","000002411 - CONDOROMA                                                                                           "]
[null,null,null,null,null,null,null,null,null,null,null,null,null,null,"000002412","COPORAQUE                                                                                           ","04","06","08","03","0406","000002412 - COPORAQUE                                                                                           "]
[null,null,null,null,null,null,null,null,null,null,null,null,null,null,"000002413","URINSAYA                                                                                            ","04","06","08","03","0406","000002413 - URINSAYA                                                                                            "]
[null,null,null,null,null,null,null,null,null,null,null,null,null,null,"000002414","HUAYHUAHUASI                                                                                        ","04","06","08","03","0406","000002414 - HUAYHUAHUASI                                                                                        "]
[null,null,null,null,null,null,null,null,null,null,null,null,null,null,"000002415","OCCORURO                                                                                            ","04","06","08","04","0406","000002415 - OCCORURO                                                                                            "]
[null,null,null,null,null,null,null,null,null,null,null,null,null,null,"000002416","PALLPATA                                                                                            ","04","06","08","05","0406","000002416 - PALLPATA                                                                                            "]
[null,null,null,null,null,null,null,null,null,null,null,null,null,null,"000002417","PICHIGUA ESPINAR                                                                                    ","04","06","08","06","0406","000002417 - PICHIGUA ESPINAR                                                                                    "]
[null,null,null,null,null,null,null,null,null,null,null,null,null,null,"000002418","SAN MIGUEL                                                                                          ","04","06","08","06","0406","000002418 - SAN MIGUEL                                                                                          "]
[null,null,null,null,null,null,null,null,null,null,null,null,null,null,"000002419","SUYKUTAMBO                                                                                          ","04","06","08","07","0406","000002419 - SUYKUTAMBO                                                                                          "]
[null,null,null,null,null,null,null,null,null,null,null,null,null,null,"000002420","ACCOCUNCA                                                                                           ","04","06","08","08","0406","000002420 - ACCOCUNCA                                                                                           "]
[null,null,null,null,null,null,null,null,null,null,null,null,null,null,"000006745","TINTAYA MARQUIRI                                                                                    ","04","06","08","01","0406","000006745 - TINTAYA MARQUIRI                                                                                    "]
[null,null,null,null,null,null,null,null,null,null,null,null,null,null,"000010061","ESSALUD-ESPINAR","04","06","08","01","0406","000010061 - ESSALUD-ESPINAR"]
[null,null,null,null,null,null,null,null,null,null,null,null,null,null,"000030366","MENTAL COMUNITARIO ESPINAR","04","06","08","01","0406","000030366 - MENTAL COMUNITARIO ESPINAR"]
[null,null,null,null,null,null,null,null,null,null,null,null,null,null,"999999999","(All)","04","99",null,null,"0499","999999999 - (All)"]
[null,null,null,null,null,null,null,null,null,null,null,null,null,null,"000002469","SAN JUAN DE KIMBIRI-VRAEM                                                                           ","05","00","09","07","0500","000002469 - SAN JUAN DE KIMBIRI-VRAEM                                                                           "]
[null,null,null,null,null,null,null,null,null,null,null,null,null,null,"000000000","(All)","05","01",null,null,"0501","000000000 - (All)"]
[null,null,null,null,null,null,null,null,null,null,null,null,null,null,"000002470","CHIRUMPIARI                                                                                         ","05","01","09","16","0501","000002470 - CHIRUMPIARI                                                                                         "]
[null,null,null,null,null,null,null,null,null,null,null,null,null,null,"000002471","LOBO TAHUANTINSUYO                                                                                  ","05","01","09","17","0501","000002471 - LOBO TAHUANTINSUYO                                                                                  "]
[null,null,null,null,null,null,null,null,null,null,null,null,null,null,"000002472","MAPITUNARI                                                                                          ","05","01","09","07","0501","000002472 - MAPITUNARI                                                                                          "]
[null,null,null,null,null,null,null,null,null,null,null,null,null,null,"000002473","UNION ROSALES                                                                                       ","05","01","09","17","0501","000002473 - UNION ROSALES                                                                                       "]
[null,null,null,null,null,null,null,null,null,null,null,null,null,null,"000002474","SAMANIATO                                                                                           ","05","01","09","07","0501","000002474 - SAMANIATO                                                                                           "]
[null,null,null,null,null,null,null,null,null,null,null,null,null,null,"000002475","KIMBIRI ALTO                                                                                        ","05","01","09","07","0501","000002475 - KIMBIRI ALTO                                                                                        "]
[null,null,null,null,null,null,null,null,null,null,null,null,null,null,"000002479","VILLA VIRGEN                                                                                        ","05","01","09",12,"0501","000002479 - VILLA VIRGEN                                                                                        "]
[null,null,null,null,null,null,null,null,null,null,null,null,null,null,"000002488","VILLA QUINTIARINA                                                                                   ","05","01","09",13,"0501","000002488 - VILLA QUINTIARINA                                                                                   "]
[null,null,null,null,null,null,null,null,null,null,null,null,null,null,"000008283","PUEBLO LIBRE                                                                                        ","05","01","09","07","0501","000008283 - PUEBLO LIBRE                                                                                        "]
[null,null,null,null,null,null,null,null,null,null,null,null,null,null,"000008284","MANITEA ALTA                                                                                        ","05","01","09","17","0501","000008284 - MANITEA ALTA                                                                                        "]
[null,null,null,null,null,null,null,null,null,null,null,null,null,null,"000008285","ANGELES                                                                                             ","05","01","09","07","0501","000008285 - ANGELES                                                                                             "]
[null,null,null,null,null,null,null,null,null,null,null,null,null,null,"000024957","EJERCITO-LA OROYA 34                                                                                 ","05","01","09",12,"0501","000024957 - EJERCITO-LA OROYA 34                                                                                 "]
[null,null,null,null,null,null,null,null,null,null,null,null,null,null,"000000000","(All)","05","02",null,null,"0502","000000000 - (All)"]
[null,null,null,null,null,null,null,null,null,null,null,null,null,null,"000002494","PICHARI                                                                                             ","05","02","09","10","0502","000002494 - PICHARI                                                                                             "]
[null,null,null,null,null,null,null,null,null,null,null,null,null,null,"000002495","MANTARO                                                                                             ","05","02","09","18","0502","000002495 - MANTARO                                                                                             "]
[null,null,null,null,null,null,null,null,null,null,null,null,null,null,"000002496","OMAYA                                                                                               ","05","02","09","10","0502","000002496 - OMAYA                                                                                               "]
[null,null,null,null,null,null,null,null,null,null,null,null,null,null,"000002497","OTARI                                                                                               ","05","02","09","10","0502","000002497 - OTARI                                                                                               "]
[null,null,null,null,null,null,null,null,null,null,null,null,null,null,"000002498","PUERTO MAYO                                                                                         ","05","02","09","10","0502","000002498 - PUERTO MAYO                                                                                         "]
[null,null,null,null,null,null,null,null,null,null,null,null,null,null,"000007113","NATIVIDAD                                                                                           ","05","02","09","10","0502","000007113 - NATIVIDAD                                                                                           "]
[null,null,null,null,null,null,null,null,null,null,null,null,null,null,"000007114","QUISTO CENTRAL                                                                                      ","05","02","09","10","0502","000007114 - QUISTO CENTRAL                                                                                      "]
[null,null,null,null,null,null,null,null,null,null,null,null,null,null,"000015104","TAMBO DEL ENE                                                                                       ","05","02","09","10","0502","000015104 - TAMBO DEL ENE                                                                                       "]
[null,null,null,null,null,null,null,null,null,null,null,null,null,null,"000015169","PITIRINQUINI                                                                                        ","05","02","09","10","0502","000015169 - PITIRINQUINI                                                                                        "]
[null,null,null,null,null,null,null,null,null,null,null,null,null,null,"000015170","PICHARI BAJA                                                                                        ","05","02","09","10","0502","000015170 - PICHARI BAJA                                                                                        "]
[null,null,null,null,null,null,null,null,null,null,null,null,null,null,"000024638","EJERCITO-MILITAR PICHARI                                                                    ","05","02","09","10","0502","000024638 - EJERCITO-MILITAR PICHARI                                                                    "]
[null,null,null,null,null,null,null,null,null,null,null,null,null,null,"000027230","SANIDAD-PICHARI PNP                                                                            ","05","02","09","10","0502","000027230 - SANIDAD-PICHARI PNP                                                                            "]
[null,null,null,null,null,null,null,null,null,null,null,null,null,null,"000027948","ESSALUD-PICHARI                                                                       ","05","02","09","10","0502","000027948 - ESSALUD-PICHARI                                                                       "]
[null,null,null,null,null,null,null,null,null,null,null,null,null,null,"000032211","NUEVO PROGRESO                                                          ","05","02","09","10","0502","000032211 - NUEVO PROGRESO                                                          "]
[null,null,null,null,null,null,null,null,null,null,null,null,null,null,"000033988","MENTAL COMUNITARIO PICHARI","05","02","09","10","0502","000033988 - MENTAL COMUNITARIO PICHARI"]
[null,null,null,null,null,null,null,null,null,null,null,null,null,null,"999999999","(All)","05","99",null,null,"0599","999999999 - (All)"]
[null,null,null,null,null,null,null,null,null,null,null,null,null,null,"000002398","HOSPITAL SANTO TOMAS","06","00","07","01","0600","000002398 - HOSPITAL SANTO TOMAS"]
[null,null,null,null,null,null,null,null,null,null,null,null,null,null,"000000000","(All)","06","09",null,null,"0609","000000000 - (All)"]
[null,null,null,null,null,null,null,null,null,null,null,null,null,null,"000002399","PULPERA                                                                                             ","06","09","07","01","0609","000002399 - PULPERA                                                                                             "]
[null,null,null,null,null,null,null,null,null,null,null,null,null,null,"000002400","ALHUACCHULLO                                                                                        ","06","09","07","01","0609","000002400 - ALHUACCHULLO                                                                                        "]
[null,null,null,null,null,null,null,null,null,null,null,null,null,null,"000002401","CCAPACMARCA                                                                                         ","06","09","07","02","0609","000002401 - CCAPACMARCA                                                                                         "]
[null,null,null,null,null,null,null,null,null,null,null,null,null,null,"000002404","COLQUEMARCA                                                                                         ","06","09","07","04","0609","000002404 - COLQUEMARCA                                                                                         "]
[null,null,null,null,null,null,null,null,null,null,null,null,null,null,"000002405","CHARAMURAY                                                                                          ","06","09","07","04","0609","000002405 - CHARAMURAY                                                                                          "]
[null,null,null,null,null,null,null,null,null,null,null,null,null,null,"000002407","LLUSCO                                                                                              ","06","09","07","06","0609","000002407 - LLUSCO                                                                                              "]
[null,null,null,null,null,null,null,null,null,null,null,null,null,null,"000002408","QUIÑOTA                                                                                             ","06","09","07","07",{"$f":"CONCATENATE(Q396,R396)","v":"0609"},"000002408 - QUIÑOTA                                                                                             "]
[null,null,null,null,null,null,null,null,null,null,null,null,null,null,"000002409","VELILLE                                                                                             ","06","09","07","08","0609","000002409 - VELILLE                                                                                             "]
[null,null,null,null,null,null,null,null,null,null,null,null,null,null,"000006746","LLIQUE                                                                                              ","06","09","07","01","0609",{"$f":"CONCATENATE(O398,\" - \",P398)","v":"000006746 - LLIQUE                                                                                              "}]
[null,null,null,null,null,null,null,null,null,null,null,null,null,null,"000006747","LUTTO                                                                                               ","06","09","07","06","0609","000006747 - LUTTO                                                                                               "]
[null,null,null,null,null,null,null,null,null,null,null,null,null,null,"000006748","COLLPA                                                                                              ","06","09","07","06","0609","000006748 - COLLPA                                                                                              "]
[null,null,null,null,null,null,null,null,null,null,null,null,null,null,"000006981","CCOYO                                                                                               ","06","09","07","01","0609","000006981 - CCOYO                                                                                               "]
[null,null,null,null,null,null,null,null,null,null,null,null,null,null,"000006982","MELLOTOTORA                                                                                         ","06","09","07","01","0609","000006982 - MELLOTOTORA                                                                                         "]
[null,null,null,null,null,null,null,null,null,null,null,null,null,null,"000006983","ORCCOMA                                                                                             ","06","09","07","01","0609","000006983 - ORCCOMA                                                                                             "]
[null,null,null,null,null,null,null,null,null,null,null,null,null,null,"000006984","CCOLLANA                                                                                            ","06","09","07","07","0609","000006984 - CCOLLANA                                                                                            "]
[null,null,null,null,null,null,null,null,null,null,null,null,null,null,"000006985","TOTORAPALLCA                                                                                        ","06","09","07","06","0609","000006985 - TOTORAPALLCA                                                                                        "]
[null,null,null,null,null,null,null,null,null,null,null,null,null,null,"000007111","YAVINA                                                                                              ","06","09","07","01","0609","000007111 - YAVINA                                                                                              "]
[null,null,null,null,null,null,null,null,null,null,null,null,null,null,"000007112","YORENCCA                                                                                            ","06","09","07","07","0609","000007112 - YORENCCA                                                                                            "]
[null,null,null,null,null,null,null,null,null,null,null,null,null,null,"000008912","ALCCA VICTORIA                                                                                      ","06","09","07","08","0609","000008912 - ALCCA VICTORIA                                                                                      "]
[null,null,null,null,null,null,null,null,null,null,null,null,null,null,"000008913","HUARACO                                                                                             ","06","09","07","04","0609","000008913 - HUARACO                                                                                             "]
[null,null,null,null,null,null,null,null,null,null,null,null,null,null,"000008914","HUAYLLANI                                                                                           ","06","09","07","04","0609","000008914 - HUAYLLANI                                                                                           "]
[null,null,null,null,null,null,null,null,null,null,null,null,null,null,"000008915","PFULLPURI CONDEPAMPA                                                                                ","06","09","07","01","0609","000008915 - PFULLPURI CONDEPAMPA                                                                                "]
[null,null,null,null,null,null,null,null,null,null,null,null,null,null,"000009963","CANCAHUANI                                                                                          ","06","09","07","02","0609","000009963 - CANCAHUANI                                                                                          "]
[null,null,null,null,null,null,null,null,null,null,null,null,null,null,"000012932","YANQUE                                                                                              ","06","09","07","04","0609","000012932 - YANQUE                                                                                              "]
[null,null,null,null,null,null,null,null,null,null,null,null,null,null,"000013185","ESSALUD-SANTO TOMAS","06","09","07","01","0609","000013185 - ESSALUD-SANTO TOMAS"]
[null,null,null,null,null,null,null,null,null,null,null,null,null,null,"000025369","PUMALLACTA","06","09","07","07","0609","000025369 - PUMALLACTA"]
[null,null,null,null,null,null,null,null,null,null,null,null,null,null,"000025371","TUNTUMA","06","09","07","08","0609","000025371 - TUNTUMA"]
[null,null,null,null,null,null,null,null,null,null,null,null,null,null,"000027008","ANTUYO","06","09","07","06","0609","000027008 - ANTUYO"]
[null,null,null,null,null,null,null,null,null,null,null,null,null,null,"000027009","TAHUAY","06","09","07","02","0609","000027009 - TAHUAY"]
[null,null,null,null,null,null,null,null,null,null,null,null,null,null,"000027011","AYACCASI","06","09","07","08","0609","000027011 - AYACCASI"]
[null,null,null,null,null,null,null,null,null,null,null,null,null,null,"000027016","HUAYCUÑUTA - URCURUTA","06","09","07","08","0609","000027016 - HUAYCUÑUTA - URCURUTA"]
[null,null,null,null,null,null,null,null,null,null,null,null,null,null,"000030940","ARCANGEL SAN MIGUEL DE ESQUINA CONGUNYA","06","09","07","01","0609","000030940 - ARCANGEL SAN MIGUEL DE ESQUINA CONGUNYA"]
[null,null,null,null,null,null,null,null,null,null,null,null,null,null,"000000000","(All)","06","01",null,null,"0601","000000000 - (All)"]
[null,null,null,null,null,null,null,null,null,null,null,null,null,null,"000002402","CHAMACA                                                                                             ","06","01","07","03","0601","000002402 - CHAMACA                                                                                             "]
[null,null,null,null,null,null,null,null,null,null,null,null,null,null,"000002403","AÑAHUICHI                                                                                           ","06","01","07","03","0601","000002403 - AÑAHUICHI                                                                                           "]
[null,null,null,null,null,null,null,null,null,null,null,null,null,null,"000002406","LIVITACA                                                                                            ","06","01","07","05","0601","000002406 - LIVITACA                                                                                            "]
[null,null,null,null,null,null,null,null,null,null,null,null,null,null,"000016325","CHILLOROYA - LIVITACA                                                                               ","06","01","07","05","0601","000016325 - CHILLOROYA - LIVITACA                                                                               "]
[null,null,null,null,null,null,null,null,null,null,null,null,null,null,"000016327","AUSANTA                                                                                             ","06","01","07","05","0601","000016327 - AUSANTA                                                                                             "]
[null,null,null,null,null,null,null,null,null,null,null,null,null,null,"000016328","UCCHUCCARCCO                                                                                        ","06","01","07","03","0601","000016328 - UCCHUCCARCCO                                                                                        "]
[null,null,null,null,null,null,null,null,null,null,null,null,null,null,"000016329","INGATA                                                                                              ","06","01","07","03","0601","000016329 - INGATA                                                                                              "]
[null,null,null,null,null,null,null,null,null,null,null,null,null,null,"000016330","CCONCHACCOLLO                                                                                       ","06","01","07","03","0601","000016330 - CCONCHACCOLLO                                                                                       "]
[null,null,null,null,null,null,null,null,null,null,null,null,null,null,"000016332","PATAQUEÑA - LIVITACA","06","01","07","05","0601","000016332 - PATAQUEÑA - LIVITACA"]
[null,null,null,null,null,null,null,null,null,null,null,null,null,null,"000016334","KISIO                                                                                               ","06","01","07","05","0601","000016334 - KISIO                                                                                               "]
[null,null,null,null,null,null,null,null,null,null,null,null,null,null,"000025739","PISQUICOCHA","06","01","07","05","0601","000025739 - PISQUICOCHA"]
[null,null,null,null,null,null,null,null,null,null,null,null,null,null,"000025740","TOTORA - REYNA DE LOS ANGELES","06","01","07","05","0601","000025740 - TOTORA - REYNA DE LOS ANGELES"]
[null,null,null,null,null,null,null,null,null,null,null,null,null,null,"999999999","(All)","06","99",null,null,"0699",{"$f":"CONCATENATE(O435,\" - \",P435)","v":"999999999 - (All)"}]
[null,null,null,null,null,null,null,null,null,null,null,null,null,null,"999999999","(All)","99","99",null,null,"9999",{"$f":"CONCATENATE(O436,\" - \",P436)","v":"999999999 - (All)"}]

{"sheet":"TD","index":1,"n_rows":298,"n_cols":257,"rows_kept":298,"cut":false,"hidden":true,"merged":[[1,1,1,3]]}
[]
[null,"Datos",null,null,null,"Tabla",{"$f":"IF(F3=\"(Todas)\",\"CUSCO \",\"\")","v":""}]
[null,"RED","99 - (All)",null,null,{"$f":"TRIM(MID(C3,5,90))","v":"(All)"},{"$f":"IF(F3=\"(All)\",\" \",F3)","v":" "}]
[null,"Micro Red","9999 - (All)",null,null,{"$f":"TRIM(MID(C4,7,90))","v":"(All)"}," "]
[null,"Establecimiento","999999999 - (All)",null,null,{"$f":"TRIM(MID(C5,12,90))","v":"(All)"}," "]
[null,"Provincia","00 - (All)",null,null,{"$f":"TRIM(MID(C6,6,90))","v":"(All)"}," "]
[null,"Distrito","0000 - (All)",null,null,{"$f":"TRIM(MID(C7,8,90))","v":"(All)"}," "]
[null,"UE","7777 - (All)",null,null,{"$f":"TRIM(MID(C8,8,90))","v":"(All)"}," "]
[]
[null,"AÑO","2024"]
[null,"MESES",1,2,3,4,5,6,7,8,9,10,11,8]
[null,"Mes_desc",{"$f":"IF(C11=1,\"ENERO\",\"\")","v":"ENERO"},{"$f":"IF(D11=2,\"FEBRERO\",\"\")","v":"FEBRERO"},{"$f":"IF(E11=3,\"MARZO\",\"\")","v":"MARZO"},{"$f":"IF(F11=4,\"ABRIL\",\"\")","v":"ABRIL"},{"$f":"IF(G11=5,\"MAYO\",\"\")","v":"MAYO"},{"$f":"IF(H11=6,\"JUNIO\",\"\")","v":"JUNIO"},{"$f":"IF(I11=7,\"JULIO\",\"\")","v":"JULIO"},{"$f":"IF(J11=8,\"AGOSTO\",\"\")","v":"AGOSTO"},{"$f":"IF(K11=9,\"SETIEMBRE\",\"\")","v":"SETIEMBRE"},{"$f":"IF(L11=10,\"OCTUBRE\",\"\")","v":"OCTUBRE"},{"$f":"IF(M11=11,\"NOVIEMBRE\",\"\")","v":"NOVIEMBRE"},{"$f":"IF(N11=12,\"DICIEMBRE\",\"\")","v":""},{"$f":"IF(C11=1,C12,IF(D11=2,D12,IF(E11=3,E12,IF(F11=4,F12,IF(G11=5,G12,IF(H11=6,H12,IF(I11=7,I12,IF(J11=8,J12,IF(K11=9,K12,IF(L11=10,L12,IF(M11=11,M12,IF(N11=12,N12,\"\"))))))))))))","v":"ENERO"}]
[]
[null,"ACUMULADO",20,22,24,26,28,30,null,34,36,38,40,42,{"$f":"MIN(C14:N14)","v":20},{"$f":"MAX(C14:N14)","v":42}]
[null,"Mes_desc_Acu",{"$f":"IF(C14=20,\"ENERO\",\"\")","v":"ENERO"},{"$f":"IF(D14=22,\"FEBRERO\",\"\")","v":"FEBRERO"},{"$f":"IF(E14=24,\"MARZO\",\"\")","v":"MARZO"},{"$f":"IF(F14=26,\"ABRIL\",\"\")","v":"ABRIL"},{"$f":"IF(G14=28,\"MAYO\",\"\")","v":"MAYO"},{"$f":"IF(H14=30,\"JUNIO\",\"\")","v":"JUNIO"},{"$f":"IF(I14=32,\"JULIO\",\"\")","v":""},{"$f":"IF(J14=34,\"AGOSTO\",\"\")","v":"AGOSTO"},{"$f":"IF(K14=36,\"SETIEMBRE\",\"\")","v":"SETIEMBRE"},{"$f":"IF(L14=38,\"OCTUBRE\",\"\")","v":"OCTUBRE"},{"$f":"IF(M14=40,\"NOVIEMBRE\",\"\")","v":"NOVIEMBRE"},{"$f":"IF(N14=42,\"DICIEMBRE\",\"\")","v":"DICIEMBRE"},{"$f":"IF(O14=C14,C15,IF(O14=D14,D15,IF(O14=E14,E15,IF(O14=F14,F15,IF(O14=G14,G15,IF(O14=H14,H15,IF(O14=I14,I15,IF(O14=J14,J15,IF(O14=K14,K15,IF(O14=L14,L15,IF(O14=M14,M15,IF(O14=N14,N15,\"\"))))))))))))","v":"ENERO"},{"$f":"IF(P14=D14,D15,IF(P14=E14,E15,IF(P14=F14,F15,IF(P14=G14,G15,IF(P14=H14,H15,IF(P14=I14,I15,IF(P14=J14,J15,IF(P14=K14,K15,IF(P14=L14,L15,IF(P14=M14,M15,IF(P14=N14,N15,IF(P14=O14,O15,\"\"))))))))))))","v":"DICIEMBRE"}]
[null,null,null,null,null,null,null,null,null,null,null,null,null,null,{"$f":"CONCATENATE(O15,\" - \",P15)","v":"ENERO - DICIEMBRE"}]
[null,null,null,null,null,null,null,null,null,null,null,null,null,null,{"$f":"IF(O14=P14,O12,O16)","v":"ENERO - DICIEMBRE"}]
[]
[]
[]
[]
[]
[]
["Anio",2024]
["UE","(Todas)"]
["Red","(Todas)"]
["MicroRed","(Todas)"]
["EESS","(Todas)"]
["Provincia","(Todas)"]
["Distrito","(Todas)"]
[]
["Etiquetas de fila","Suma de trans_01","Suma de trans_02","Suma de trans_03","Suma de trans_04","Suma de trans_05","Suma de trans_06","Suma de trans_07","Suma de trans_08","Suma de trans_09","Suma de trans_10","Suma de trans_11","Suma de trans_12","Suma de trans_13","Suma de trans_14","Suma de trans_15","Suma de trans_16","Suma de trans_17","Suma de trans_18","Suma de trans_19","Suma de trans_20","Suma de trans_21","Suma de trans_22","Suma de trans_23","Suma de trans_24","Suma de trans_25","Suma de trans_26","Suma de trans_27","Suma de trans_28","Suma de trans_29","Suma de trans_30","Suma de trans_31","Suma de trans_32","Suma de trans_33","Suma de trans_34","Suma de trans_35","Suma de trans_36","Suma de trans_37","Suma de trans_38","Suma de trans_39","Suma de trans_40","Suma de trans_41","Suma de trans_42","Suma de trans_43","Suma de trans_44","Suma de trans_45","Suma de trans_46","Suma de trans_47","Suma de trans_48","Suma de trans_49","Suma de trans_50","Suma de trans_51","Suma de trans_52","Suma de trans_53","Suma de trans_54","Suma de trans_55","Suma de trans_56","Suma de trans_57","Suma de trans_58","Suma de trans_59","Suma de trans_60"]
[1,0,0,0,0,0,0,0,0,0,0,0,0,0,0,0,0,0,0,0,0,0,0,0,0,0,0,0,0,0,0,0,0,0,0,0,0,0,0,0,0,0,0,0,0,0,0,0,0,0,0,0,0,0,0,0,0,0,0,0,0]
[2,0,0,0,0,0,0,0,0,0,0,0,0,0,0,0,0,0,0,0,0,0,0,0,0,0,0,0,0,0,0,0,0,0,0,0,0,0,0,0,0,0,0,0,0,0,0,0,0,0,0,0,0,0,0,0,0,0,0,0,0]
[3,0,0,0,0,0,0,0,0,0,0,0,0,0,0,0,0,0,0,0,0,0,0,0,0,0,0,0,0,0,0,0,0,0,0,0,0,0,0,0,0,0,0,0,0,0,0,0,0,0,0,0,0,0,0,0,0,0,0,0,0]
[4,60,22,18,0,0,0,0,60,0,0,0,0,0,0,0,0,0,0,0,0,0,0,0,0,0,0,0,0,0,0,0,0,0,0,0,0,0,0,0,0,0,0,0,0,0,0,0,0,0,0,0,0,0,0,0,0,0,0,0,0]
[5,40,44,0,0,0,0,0,84,0,0,0,0,0,0,0,0,0,0,0,0,0,0,0,0,0,0,0,0,0,0,0,0,0,0,0,0,0,0,0,0,0,0,0,0,0,0,0,0,0,0,0,0,0,0,0,0,0,0,0,0]
[6,0,0,0,0,0,0,0,0,0,0,0,0,0,0,0,0,0,0,0,0,0,0,0,0,0,0,0,0,0,0,0,0,0,0,0,0,0,0,0,0,0,0,0,0,0,0,0,0,0,0,0,0,0,0,0,0,0,0,0,0]
[7,0,0,0,0,0,0,0,0,0,0,0,0,0,0,0,0,0,0,0,0,0,0,0,0,0,0,0,0,0,0,0,0,0,0,0,0,0,0,0,0,0,0,0,0,0,0,0,0,0,0,0,0,0,0,0,0,0,0,0,0]
[8,2,2,2,0,12,12,0,16,0,0,0,0,0,0,0,0,0,0,0,0,0,0,0,0,0,0,0,0,0,0,0,0,0,0,0,0,0,0,0,0,0,0,0,0,0,0,0,0,0,0,0,0,0,0,0,0,0,0,0,0]
[9,76,75,76,33,33,33,0,184,0,0,0,0,0,0,0,0,0,0,0,0,0,0,0,0,0,0,0,0,0,0,0,1,36,0,0,0,0,0,0,0,0,0,3,102,0,0,0,0,0,0,0,0,0,0,0,0,0,0,0,0]
[10,64,64,64,76,76,76,0,204,0,0,0,0,0,0,0,0,0,0,0,0,0,0,0,0,0,0,0,0,0,0,0,0,0,0,0,0,0,0,0,0,0,0,3,102,0,0,0,0,0,0,0,0,0,0,0,0,0,0,0,0]
[11,77,88,77,156,159,159,0,324,0,0,0,0,0,0,0,0,0,0,0,0,0,0,0,0,0,0,0,0,0,0,0,0,0,0,0,0,0,0,0,0,0,0,0,0,0,0,0,0,0,0,0,0,0,0,0,0,0,0,0,0]
[12,0,0,0,0,0,0,0,0,0,0,0,0,0,0,0,0,0,0,0,0,0,0,0,0,0,0,0,0,0,0,0,0,0,0,0,0,0,0,0,0,0,0,0,0,0,0,0,0,0,0,0,0,0,0,0,0,0,0,0,0]
["Total general",319,295,237,265,280,280,0,872,0,0,0,0,0,0,0,0,0,0,0,0,0,0,0,0,0,0,0,0,0,0,0,1,36,0,0,0,0,0,0,0,0,0,6,204,0,0,0,0,0,0,0,0,0,0,0,0,0,0,0,0]
[]
[]
[]
[]
[]
["Anio",2024]
["UE","(Todas)"]
["Red","(Todas)"]
["MicroRed","(Todas)"]
["EESS","(Todas)"]
["Provincia","(Todas)"]
["Distrito","(Todas)"]
[]
["Etiquetas de fila","Suma de Mater_01","Suma de Mater_02","Suma de Mater_03","Suma de Mater_04","Suma de Mater_05","Suma de Mater_06","Suma de Mater_07","Suma de Mater_08","Suma de Mater_09","Suma de Mater_10","Suma de Mater_100","Suma de Mater_11","Suma de Mater_12","Suma de Mater_13","Suma de Mater_14","Suma de Mater_15","Suma de Mater_16","Suma de Mater_17","Suma de Mater_18","Suma de Mater_19","Suma de Mater_20","Suma de Mater_21","Suma de Mater_22","Suma de Mater_23","Suma de Mater_24","Suma de Mater_25","Suma de Mater_26","Suma de Mater_27","Suma de Mater_28","Suma de Mater_29","Suma de Mater_30","Suma de Mater_31","Suma de Mater_32","Suma de Mater_33","Suma de Mater_34","Suma de Mater_35","Suma de Mater_36","Suma de Mater_37","Suma de Mater_38","Suma de Mater_39","Suma de Mater_40","Suma de Mater_41","Suma de Mater_42","Suma de Mater_43","Suma de Mater_44","Suma de Mater_45","Suma de Mater_46","Suma de Mater_47","Suma de Mater_48","Suma de Mater_49","Suma de Mater_50","Suma de Mater_51","Suma de Mater_52","Suma de Mater_53","Suma de Mater_54","Suma de Mater_55","Suma de Mater_56","Suma de Mater_57","Suma de Mater_58","Suma de Mater_59","Suma de Mater_60","Suma de Mater_62","Suma de Mater_63","Suma de Mater_61","Suma de Mater_64","Suma de Mater_65","Suma de Mater_66","Suma de Mater_67","Suma de Mater_68","Suma de Mater_69","Suma de Mater_70","Suma de Mater_71","Suma de Mater_72","Suma de Mater_73","Suma de Mater_74","Suma de Mater_75","Suma de Mater_76","Suma de Mater_77","Suma de Mater_78","Suma de Mater_79","Suma de Mater_80","Suma de Mater_81","Suma de Mater_82","Suma de Mater_83","Suma de Mater_84","Suma de Mater_85","Suma de Mater_86","Suma de Mater_87","Suma de Mater_88","Suma de Mater_89","Suma de Mater_90","Suma de Mater_91","Suma de Mater_92","Suma de Mater_93","Suma de Mater_94","Suma de Mater_95","Suma de Mater_96","Suma de Mater_97","Suma de Mater_98","Suma de Mater_99","Suma de Mater_87_1","Suma de Mater_91_1","Suma de Mater_91_2"]
[1,0,0,0,0,0,0,0,0,0,0,0,0,0,0,0,0,0,0,0,0,0,0,0,0,0,0,0,0,0,0,0,0,0,0,0,0,0,0,0,0,0,0,0,0,0,0,0,0,0,0,0,0,0,0,0,0,0,0,0,0,0,0,0,0,0,0,0,0,0,0,0,0,0,0,0,0,0,0,0,0,0,0,0,0,0,0,0,0,0,0,0,0,0,0,0,0,0,0,0,0,0,0,0]
[2,0,0,0,0,0,0,0,0,0,0,0,0,0,0,0,0,0,0,0,0,0,0,0,0,0,0,0,0,0,0,0,0,0,0,0,0,0,0,0,0,0,0,0,0,0,0,0,0,0,0,0,0,0,0,0,0,0,0,0,0,0,0,0,0,0,0,0,0,0,0,0,0,0,0,0,0,0,0,0,0,0,0,0,0,0,0,0,0,0,0,0,0,0,0,0,0,0,0,0,0,0,0,0]
[3,0,0,0,0,0,0,0,0,0,0,0,0,0,0,0,0,0,0,0,0,0,0,0,0,0,0,0,0,0,0,0,0,0,0,0,0,0,0,0,0,0,0,0,0,0,0,0,0,0,0,0,0,0,0,0,0,0,0,0,0,0,0,0,0,0,0,0,0,0,0,0,0,0,0,0,0,0,0,0,0,0,0,0,0,0,0,0,0,0,0,0,0,0,0,0,0,0,0,0,0,0,0,0]
[4,0,0,0,0,0,0,0,0,0,0,0,0,0,0,0,0,0,0,0,0,0,0,0,0,0,0,0,0,0,0,0,0,0,0,0,0,0,0,0,0,0,0,0,0,0,0,0,0,0,0,0,0,0,0,0,0,0,0,0,0,0,0,0,0,0,0,0,0,0,0,0,0,0,0,0,0,0,0,0,0,0,0,0,0,0,0,0,0,0,0,0,0,0,0,0,0,0,0,0,0,0,0,0]
[5,0,0,0,0,0,0,0,0,0,0,0,0,0,0,0,0,0,0,0,0,0,0,0,0,0,0,1,24,0,0,0,0,0,0,0,0,0,0,0,0,0,0,0,0,0,0,0,0,0,0,0,0,0,0,0,0,0,0,0,0,0,0,0,0,0,0,0,0,0,0,0,0,0,0,0,0,0,0,0,0,0,0,0,0,0,0,0,0,0,0,0,0,0,0,0,0,0,0,0,0,0,0,0]
[6,0,0,0,0,0,0,0,0,0,0,0,0,0,0,0,0,0,0,0,0,0,0,0,0,0,0,0,0,0,0,0,0,0,0,0,0,0,0,1,24,0,0,0,0,0,0,0,0,0,0,0,0,0,0,0,0,0,0,0,0,0,0,0,0,0,0,0,0,0,0,0,0,0,0,0,0,0,0,0,0,0,0,0,0,0,0,0,0,0,0,0,0,0,0,0,0,0,0,0,0,0,0,0]
[7,0,0,0,0,0,0,0,0,0,0,0,0,0,0,0,0,0,0,0,0,0,0,0,0,0,0,0,0,0,0,0,0,0,0,0,0,0,0,0,0,0,0,0,0,0,0,0,0,0,0,0,0,0,0,0,0,0,0,0,0,0,0,0,0,0,0,0,0,0,0,0,0,0,0,0,0,0,0,0,0,0,0,0,0,0,0,0,0,0,0,0,0,0,0,0,0,0,0,0,0,0,0,0]
[8,0,0,0,0,0,0,0,0,0,0,0,0,0,0,0,0,0,0,0,0,1,21,0,0,1,21,0,0,0,0,0,0,0,0,0,0,0,0,0,0,0,0,2,66,1,4,0,0,0,0,0,0,0,0,0,0,0,0,2,62,0,0,0,0,0,0,0,0,0,0,0,0,3,135,0,0,0,0,0,0,0,0,0,0,0,0,0,0,0,0,0,0,0,0,0,0,0,0,0,0,0,0,0]
[9,0,0,0,0,0,0,0,0,0,0,0,0,0,0,0,0,0,0,0,0,0,0,1,21,0,0,1,34,0,0,1,44,0,0,1,34,0,0,1,34,0,0,3,102,0,0,0,0,0,0,0,0,0,0,0,0,0,0,0,0,0,1,36,0,0,0,1,30,0,0,0,0,0,0,0,0,1,42,0,0,1,50,0,0,1,50,0,0,0,0,0,0,0,0,0,0,0,0,0,0,0,0,0]
[10,0,3,6,0,0,0,6,0,0,0,0,0,0,0,0,0,0,0,0,0,0,0,1,20,0,0,0,0,0,0,0,0,0,0,0,0,0,0,0,0,0,0,0,0,0,0,0,0,0,0,0,0,0,0,0,0,0,0,1,36,0,0,0,0,2,70,2,70,0,0,1,36,0,0,0,0,0,0,0,0,0,0,0,0,0,0,0,0,0,0,0,0,0,0,0,0,0,0,0,0,0,0,0]
[11,0,9,22,0,0,0,22,0,0,7,0,0,0,0,0,0,0,0,0,0,0,0,1,20,0,0,0,0,0,0,0,0,0,0,0,0,0,0,0,0,0,0,0,0,0,0,0,0,0,0,0,0,0,0,0,0,0,0,1,45,0,0,0,0,1,45,1,45,0,0,0,0,0,0,0,0,0,0,0,0,0,0,0,0,0,0,0,0,0,0,0,0,0,0,0,0,0,0,0,0,0,0,0]
[12,0,11,23,0,0,0,23,0,0,0,0,0,0,0,0,0,0,0,0,0,0,0,0,0,0,0,0,0,0,0,0,0,0,0,0,0,0,0,0,0,0,0,0,0,0,0,0,0,0,0,0,0,0,0,0,0,0,0,0,0,0,0,0,0,0,0,0,0,0,0,0,0,0,0,0,0,0,0,0,0,0,0,0,0,0,0,0,0,0,0,0,0,0,0,0,0,0,0,0,0,0,0,0]
["Total general",0,23,51,0,0,0,51,0,0,7,0,0,0,0,0,0,0,0,0,0,1,21,3,61,1,21,2,58,0,0,1,44,0,0,1,34,0,0,2,58,0,0,5,168,1,4,0,0,0,0,0,0,0,0,0,0,0,0,4,143,0,1,36,0,3,115,4,145,0,0,1,36,3,135,0,0,1,42,0,0,1,50,0,0,1,50,0,0,0,0,0,0,0,0,0,0,0,0,0,0,0,0,0]
[]
[]
[]
[]
[]
[]
["Anio",2024]
["UE","(Todas)"]
["Red","(Todas)"]
["MicroRed","(Todas)"]
["EESS","(Todas)"]
["Provincia","(Todas)"]
["Distrito","(Todas)"]
[]
["Etiquetas de fila","Suma de cancer01","Suma de cancer02","Suma de cancer03","Suma de cancer04","Suma de cancer05","Suma de cancer06","Suma de cancer07","Suma de cancer08","Suma de cancer09","Suma de cancer10","Suma de cancer11","Suma de cancer12","Suma de cancer13","Suma de cancer14","Suma de cancer15","Suma de cancer16","Suma de cancer17","Suma de cancer19","Suma de cancer18","Suma de cancer20","Suma de cancer21","Suma de cancer22","Suma de cancer23","Suma de cancer24","Suma de cancer25","Suma de cancer26","Suma de cancer27","Suma de cancer28","Suma de cancer29","Suma de cancer30","Suma de cancer31","Suma de cancer32","Suma de cancer34","Suma de cancer35","Suma de cancer33","Suma de cancer36","Suma de cancer37","Suma de cancer38","Suma de cancer42","Suma de cancer39","Suma de cancer40","Suma de cancer41","Suma de cancer43","Suma de cancer44","Suma de cancer45","Suma de cancer46","Suma de cancer47","Suma de cancer48","Suma de cancer49","Suma de cancer50","Suma de cancer51","Suma de cancer52","Suma de cancer53","Suma de cancer54","Suma de cancer55","Suma de cancer56","Suma de cancer57","Suma de cancer58","Suma de cancer59","Suma de cancer60"]
[1,0,0,0,0,0,0,0,0,0,0,0,0,0,0,0,0,0,0,0,0,0,0,0,0,0,0,0,0,0,0,0,0,0,0,0,0,0,0,0,0,0,0,0,0,0,0,0,0,0,0,0,0,0,0,0,0,0,0,0,0]
[2,0,0,0,0,0,0,0,0,0,0,0,0,0,0,0,0,0,0,0,0,0,0,0,0,0,0,0,0,0,0,0,0,0,0,0,0,0,0,0,0,0,0,0,0,0,0,0,0,0,0,0,0,0,0,0,0,0,0,0,0]
[3,0,0,0,0,0,0,0,0,0,0,0,0,0,0,0,0,0,0,0,0,0,0,0,0,0,0,0,0,0,0,0,0,0,0,0,0,0,0,0,0,0,0,0,0,0,0,0,0,0,0,0,0,0,0,0,0,0,0,0,0]
[4,0,0,0,0,0,0,0,0,0,0,0,0,0,0,0,0,0,0,0,0,0,0,0,0,0,0,0,0,0,0,0,0,0,0,0,0,0,0,0,0,0,0,0,0,0,0,0,0,0,0,0,0,0,0,0,0,0,0,0,0]
[5,0,0,0,0,0,0,0,0,0,0,0,0,0,0,0,0,0,0,0,0,0,0,0,0,0,0,0,0,0,0,0,0,0,0,0,0,0,0,0,0,0,0,0,0,0,0,0,0,0,0,0,0,0,0,0,0,0,0,0,0]
[6,31,31,0,31,31,0,0,0,0,0,0,0,0,0,0,0,0,0,0,0,0,0,0,0,0,0,0,0,0,0,0,0,0,0,0,0,0,0,0,0,0,0,0,0,0,0,0,0,0,0,0,0,0,0,0,0,0,0,0,0]
[7,0,0,0,0,0,0,0,0,0,0,0,0,0,0,0,0,0,0,0,0,0,0,0,0,0,0,0,0,0,0,0,0,0,0,0,0,0,0,0,0,0,0,0,0,0,0,0,0,0,0,0,0,0,0,0,0,0,0,0,0]
[8,0,12,0,0,0,0,0,0,0,0,0,0,0,0,0,0,0,0,0,2,0,0,0,0,0,0,0,0,0,0,0,0,0,0,0,0,0,0,0,0,0,0,0,0,0,0,0,0,0,0,0,0,0,0,0,0,0,4,56,0]
[9,45,45,45,45,135,0,0,0,0,0,0,0,0,0,0,0,0,0,0,0,0,2,0,0,1,30,0,0,0,0,0,0,0,0,0,0,0,0,0,30,0,0,0,0,0,0,0,0,0,0,0,0,0,0,0,0,0,2,56,0]
[10,36,36,36,36,108,0,0,0,0,0,0,0,0,0,0,0,0,0,0,0,0,0,0,0,0,0,0,0,0,0,0,0,0,0,0,0,0,0,0,0,0,0,0,0,0,0,0,0,0,0,0,0,0,0,0,0,0,0,0,0]
[11,104,106,105,105,314,0,0,0,0,0,0,0,0,0,0,0,0,0,0,0,0,0,0,0,0,0,0,0,0,0,0,0,0,0,0,0,0,0,0,0,0,0,0,0,0,0,0,0,0,0,0,0,0,0,0,0,0,0,0,0]
[12,48,48,49,48,145,0,0,0,0,0,0,0,0,0,0,0,0,0,0,0,0,0,0,0,0,0,0,0,0,0,0,0,0,0,0,0,0,0,0,0,0,0,0,0,0,0,0,0,0,0,0,0,0,0,0,0,0,0,0,0]
["Total general",264,278,235,265,733,0,0,0,0,0,0,0,0,0,0,0,0,0,0,2,0,2,0,0,1,30,0,0,0,0,0,0,0,0,0,0,0,0,0,30,0,0,0,0,0,0,0,0,0,0,0,0,0,0,0,0,0,6,112,0]
[]
[]
[]
[]
[]
[]
["Anio",2024]
["UE","(Todas)"]
["Red","(Todas)"]
["MicroRed","(Todas)"]
["Distrito","(Todas)"]
["EESS","(Todas)"]
["Provincia","(Todas)"]
[]
["Etiquetas de fila","Suma de tbc_01","Suma de tbc_02","Suma de tbc_03","Suma de tbc_04","Suma de tbc_05","Suma de tbc_06","Suma de tbc_07","Suma de tbc_08","Suma de tbc_09","Suma de tbc_10","Suma de tbc_11","Suma de tbc_12","Suma de tbc_100","Suma de tbc_101","Suma de tbc_102","Suma de tbc_103","Suma de tbc_104","Suma de tbc_105","Suma de tbc_106","Suma de tbc_107","Suma de tbc_108","Suma de tbc_109","Suma de tbc_110","Suma de tbc_111","Suma de tbc_112","Suma de tbc_113","Suma de tbc_114","Suma de tbc_115","Suma de tbc_116","Suma de tbc_117","Suma de tbc_118","Suma de tbc_119","Suma de tbc_120","Suma de tbc_121","Suma de tbc_122","Suma de tbc_123","Suma de tbc_124","Suma de tbc_125","Suma de tbc_127","Suma de tbc_126","Suma de tbc_128","Suma de tbc_129","Suma de tbc_13","Suma de tbc_130","Suma de tbc_131","Suma de tbc_132","Suma de tbc_133","Suma de tbc_134","Suma de tbc_135","Suma de tbc_136","Suma de tbc_137","Suma de tbc_138","Suma de tbc_139","Suma de tbc_14","Suma de tbc_140","Suma de tbc_15","Suma de tbc_16","Suma de tbc_17","Suma de tbc_18","Suma de tbc_19","Suma de tbc_20","Suma de tbc_21","Suma de tbc_22","Suma de tbc_23","Suma de tbc_24","Suma de tbc_25","Suma de tbc_26","Suma de tbc_27","Suma de tbc_28","Suma de tbc_29","Suma de tbc_30","Suma de tbc_31","Suma de tbc_32","Suma de tbc_33","Suma de tbc_34","Suma de tbc_35","Suma de tbc_36","Suma de tbc_37","Suma de tbc_38","Suma de tbc_39","Suma de tbc_40","Suma de tbc_41","Suma de tbc_42","Suma de tbc_43","Suma de tbc_44","Suma de tbc_45","Suma de tbc_46","Suma de tbc_47","Suma de tbc_48","Suma de tbc_49","Suma de tbc_50","Suma de tbc_51","Suma de tbc_52","Suma de tbc_53","Suma de tbc_54","Suma de tbc_55","Suma de tbc_56","Suma de tbc_57","Suma de tbc_58","Suma de tbc_59","Suma de tbc_60","Suma de tbc_61","Suma de tbc_62","Suma de tbc_63","Suma de tbc_64","Suma de tbc_65","Suma de tbc_66","Suma de tbc_67","Suma de tbc_68","Suma de tbc_69","Suma de tbc_70","Suma de tbc_71","Suma de tbc_72","Suma de tbc_73","Suma de tbc_74","Suma de tbc_75","Suma de tbc_76","Suma de tbc_78","Suma de tbc_77","Suma de tbc_79","Suma de tbc_80","Suma de tbc_81","Suma de tbc_82","Suma de tbc_83","Suma de tbc_84","Suma de tbc_85","Suma de tbc_86","Suma de tbc_87","Suma de tbc_88","Suma de tbc_89","Suma de tbc_90","Suma de tbc_91","Suma de tbc_92","Suma de tbc_93","Suma de tbc_94","Suma de tbc_95","Suma de tbc_96","Suma de tbc_97","Suma de tbc_98","Suma de tbc_99"]
[1,0,0,0,0,0,0,0,0,0,0,0,0,0,0,0,0,0,0,0,0,0,0,0,0,0,0,0,0,0,0,0,0,0,0,0,0,0,0,0,0,0,0,0,0,0,0,0,0,0,0,0,0,0,0,0,0,0,0,0,0,0,0,0,0,0,0,0,0,0,0,0,0,0,0,0,0,0,0,0,0,0,0,0,0,0,0,0,0,0,0,0,0,0,0,0,0,0,0,0,0,0,0,0,0,0,0,0,0,0,0,0,0,0,0,0,0,0,0,0,0,0,0,0,0,0,0,0,0,0,0,0,0,0,0,0,0,0,0,0,0]
[2,5,0,0,0,0,0,0,0,0,2,31,0,0,0,0,0,0,0,0,0,0,0,0,0,0,0,0,0,0,0,0,0,0,0,0,0,0,0,0,0,0,0,0,0,0,0,0,0,0,0,0,0,0,0,0,0,0,0,0,0,0,0,0,0,0,0,0,0,0,0,0,0,0,0,0,0,0,0,0,0,0,0,0,0,0,0,0,0,0,0,0,0,0,0,0,0,0,0,0,0,0,0,0,0,0,0,0,0,0,0,0,0,0,0,0,0,0,0,0,0,0,0,0,0,0,0,0,0,0,0,0,0,0,0,0,0,0,0,0,0]
[3,0,5,0,0,0,0,0,0,0,0,0,0,0,0,0,0,0,0,0,0,0,0,0,0,0,0,0,0,0,0,0,0,0,0,0,0,0,0,0,0,0,0,0,0,0,0,0,0,0,0,0,0,0,1,0,13,1,13,0,0,0,0,0,0,0,0,0,0,0,0,0,0,0,0,0,0,0,0,0,0,0,0,0,0,0,0,0,0,0,0,0,0,0,0,0,0,0,0,0,0,0,0,0,0,0,0,0,0,0,0,0,0,0,0,0,0,0,0,0,0,0,0,0,0,0,0,0,0,0,0,0,0,0,0,0,0,0,0,0,0]
[4,3,0,0,0,0,0,0,0,0,0,0,0,0,0,0,0,0,0,0,0,0,0,0,0,0,0,0,0,0,0,0,0,0,0,0,0,0,0,0,0,0,0,0,0,0,0,0,0,0,0,0,0,0,0,0,0,0,0,0,0,0,0,1,23,0,0,0,0,0,0,0,0,0,0,0,0,0,0,0,0,0,0,0,0,0,0,0,0,0,0,0,0,0,0,0,0,0,0,0,0,0,0,0,0,0,0,0,0,0,0,0,0,0,0,0,0,0,0,0,0,0,0,0,0,0,0,0,0,0,0,0,0,0,0,0,0,0,0,0,0]
[5,3,3,0,0,0,0,0,0,0,0,0,0,0,0,0,0,0,0,0,0,0,0,0,0,0,0,0,0,0,0,0,0,0,0,0,0,0,0,0,0,0,0,0,0,0,0,0,0,0,0,0,0,0,0,0,0,0,0,0,0,0,0,0,0,0,0,0,0,0,0,0,0,0,0,0,0,0,0,0,0,0,0,0,0,0,0,0,0,0,0,0,0,0,0,0,0,0,0,0,0,0,0,0,0,0,0,0,0,0,0,0,0,0,0,0,0,0,0,0,0,0,0,0,0,0,0,0,0,0,0,0,0,0,0,0,0,0,0,0,0]
[6,4,3,0,0,0,0,0,0,0,0,0,0,0,0,0,0,0,0,0,0,0,0,0,0,0,0,0,0,0,0,0,0,0,0,0,0,0,0,0,0,0,0,0,0,0,0,0,0,0,0,0,0,0,0,0,0,0,0,0,0,0,0,1,23,0,0,0,0,0,0,0,0,0,0,0,0,0,0,0,0,0,0,0,0,0,0,0,0,0,0,0,0,0,0,0,0,1,18,0,0,0,0,0,0,0,0,0,0,0,0,0,0,0,0,0,0,0,0,0,0,0,0,0,0,0,0,0,0,0,0,0,0,0,0,0,0,0,0,0,0]
[7,6,9,0,0,0,0,0,0,0,0,0,0,0,0,0,0,0,0,0,0,0,0,0,0,0,0,0,0,0,0,0,0,0,0,0,0,0,0,0,0,0,0,0,0,0,0,0,0,0,0,0,0,0,0,0,0,0,0,0,0,0,0,0,0,0,0,0,0,0,0,0,0,0,0,0,0,0,0,0,0,0,0,0,0,0,0,0,0,0,0,0,0,0,0,0,0,0,0,0,0,0,0,0,0,0,0,0,0,0,0,0,0,0,0,0,0,0,0,0,0,0,0,0,0,0,0,0,0,0,0,0,0,0,0,0,0,0,0,0,0]
[8,8,6,0,0,0,0,0,0,0,0,0,0,0,0,0,0,0,0,0,0,0,0,0,0,0,0,0,0,0,0,0,0,0,0,0,0,0,0,0,0,0,0,0,0,0,0,0,0,0,0,0,0,0,0,0,0,0,0,2,66,2,66,0,0,2,62,0,0,2,62,0,0,2,62,0,0,0,0,0,0,2,64,0,0,2,62,0,0,0,0,0,0,0,0,0,0,0,0,0,0,0,0,0,0,0,0,0,0,0,0,0,0,0,0,0,0,0,0,0,0,0,0,0,0,0,0,0,0,0,0,0,0,0,0,0,0,0,0,0,0]
[9,6,8,0,0,0,23,0,0,0,0,0,1,0,0,0,0,0,0,0,0,0,0,0,0,0,0,0,0,0,0,0,0,0,0,0,0,0,0,0,0,0,0,15,0,0,0,0,0,0,0,0,0,0,0,0,0,0,0,0,0,2,66,0,0,0,0,0,0,2,66,0,0,0,0,0,0,0,0,0,0,0,0,0,0,2,66,0,0,0,0,1,1,0,0,0,0,0,0,0,0,0,0,0,0,0,0,0,0,0,0,0,0,0,0,0,0,1,1,2,2,0,0,0,0,0,0,0,0,0,0,0,0,0,0,0,0,0,0,0,0]
[10,6,6,0,0,0,0,23,0,0,0,0,0,0,0,0,0,0,0,0,0,0,0,0,0,0,0,0,0,0,0,0,0,0,0,0,0,0,0,0,0,0,0,0,0,0,0,0,0,0,0,0,0,0,0,0,0,0,0,0,0,0,0,0,0,1,36,0,0,0,0,0,0,0,0,0,0,0,0,0,0,0,0,0,0,0,0,0,0,0,0,0,0,0,0,0,0,0,0,0,0,0,0,0,0,0,0,0,0,0,0,0,0,0,0,0,0,0,0,0,0,0,0,0,0,0,0,0,0,0,0,0,0,0,0,0,0,0,0,0,0]
[11,5,3,0,0,0,0,0,0,0,0,0,0,0,0,0,0,0,0,0,0,0,0,0,0,0,0,0,0,0,0,0,0,0,0,0,0,0,0,0,0,0,0,0,0,0,0,0,0,0,0,0,0,0,0,0,0,0,0,0,0,0,0,0,0,0,0,0,0,1,36,0,0,0,0,0,0,0,0,0,0,0,0,0,0,0,0,0,0,0,0,0,0,0,0,0,0,0,0,0,0,0,0,0,0,0,0,0,0,0,0,0,0,0,0,0,0,0,0,0,0,0,0,0,0,0,0,0,0,0,0,0,0,0,0,0,0,0,0,0,0]
[12,0,6,0,0,0,0,0,0,0,0,0,0,0,0,0,0,0,0,0,0,0,0,0,0,0,0,0,0,0,0,0,0,0,0,0,0,0,0,0,0,0,0,0,0,0,0,0,0,0,0,0,0,0,0,0,0,0,0,0,0,0,0,0,0,0,0,0,0,0,0,0,0,0,0,0,0,0,0,0,0,0,0,0,0,0,0,0,0,0,0,0,0,0,0,0,0,0,0,0,0,0,0,0,0,0,0,0,0,0,0,0,0,0,0,0,0,0,0,0,0,0,0,0,0,0,0,0,0,0,0,0,0,0,0,0,0,0,0,0,0]
["Total general",46,49,0,0,0,23,23,0,0,2,31,1,0,0,0,0,0,0,0,0,0,0,0,0,0,0,0,0,0,0,0,0,0,0,0,0,0,0,0,0,0,0,15,0,0,0,0,0,0,0,0,0,0,1,0,13,1,13,2,66,4,132,2,46,3,98,0,0,5,164,0,0,2,62,0,0,0,0,0,0,2,64,0,0,4,128,0,0,0,0,1,1,0,0,0,0,1,18,0,0,0,0,0,0,0,0,0,0,0,0,0,0,0,0,0,0,1,1,2,2,0,0,0,0,0,0,0,0,0,0,0,0,0,0,0,0,0,0,0,0]
[]
[]
[]
[]
[]
["Anio",2024]
["UE","(Todas)"]
["Red","(Todas)"]
["MicroRed","(Todas)"]
["EESS","(Todas)"]
["Provincia","(Todas)"]
["Distrito","(Todas)"]
[]
["Etiquetas de fila","Suma de mental_13","Suma de mental_14","Suma de mental_15","Suma de mental_16","Suma de mental_17","Suma de mental_18","Suma de mental_19","Suma de mental_20","Suma de mental_21","Suma de mental_22","Suma de mental_23","Suma de mental_24","Suma de mental_25","Suma de mental_26","Suma de mental_27","Suma de mental_28","Suma de mental_29","Suma de mental_30","Suma de mental_31","Suma de mental_32","Suma de mental_33","Suma de mental_34","Suma de mental_35","Suma de mental_36","Suma de mental_37","Suma de mental_38","Suma de mental_01_1","Suma de mental_01_2","Suma de mental_01_3","Suma de mental_02_1","Suma de mental_02_2","Suma de mental_02_3","Suma de mental_03_1","Suma de mental_03_2","Suma de mental_03_3","Suma de mental_04_1","Suma de mental_04_2","Suma de mental_04_3","Suma de mental_05_1","Suma de mental_05_2","Suma de mental_05_3","Suma de mental_06_1","Suma de mental_06_2","Suma de mental_06_3","Suma de mental_07_1","Suma de mental_07_2","Suma de mental_07_3","Suma de mental_08_1","Suma de mental_08_2","Suma de mental_08_3","Suma de mental_09_1","Suma de mental_09_2","Suma de mental_09_3","Suma de mental_10_1","Suma de mental_10_2","Suma de mental_10_3","Suma de mental_12"]
[1,0,0,0,0,0,0,0,0,0,0,0,0,0,0,0,0,0,0,0,0,0,0,0,0,0,0,0,0,0,0,0,0,0,0,0,0,0,0,0,0,0,0,0,0,0,0,0,0,0,0,0,0,0,0,0,0,0]
[2,0,0,0,0,0,0,0,0,0,0,0,0,0,0,0,0,0,0,0,0,0,0,0,0,0,0,0,0,0,0,0,0,0,0,0,0,0,0,0,0,0,0,0,0,0,0,0,0,0,0,0,0,0,0,0,0,0]
[3,0,0,0,0,0,0,0,0,0,0,0,0,0,0,0,0,0,0,0,0,0,0,0,0,0,0,0,0,0,0,0,0,0,0,0,0,0,0,0,0,0,0,0,0,0,0,0,0,0,0,0,0,0,0,0,0,0]
[4,0,0,0,0,0,0,0,0,0,0,0,0,0,0,0,0,0,0,0,0,0,0,0,0,0,0,0,0,0,0,0,0,0,0,0,0,0,0,0,0,0,0,0,0,0,0,0,0,0,0,0,0,0,0,0,0,0]
[5,0,0,0,0,0,0,0,0,0,0,0,0,0,0,0,0,0,0,0,0,0,0,0,0,0,0,0,0,0,0,0,0,0,0,0,0,0,0,0,0,0,0,0,0,0,0,0,0,0,0,0,0,0,0,0,0,0]
[6,0,0,0,0,0,0,0,0,0,0,0,0,0,0,0,0,0,0,0,0,0,0,0,0,0,0,0,0,0,0,0,0,0,0,0,0,0,0,0,0,0,0,0,0,0,0,0,0,0,0,0,0,0,0,0,0,0]
[7,0,0,0,0,0,0,0,0,0,0,0,0,0,0,0,0,0,0,0,0,0,0,0,0,0,0,0,0,0,0,0,0,0,0,0,0,0,0,0,0,0,0,0,0,0,0,0,0,0,0,0,0,0,0,0,0,0]
[8,0,0,0,0,0,0,0,0,0,0,0,0,0,0,0,0,0,0,0,0,0,0,0,0,0,0,0,2,0,0,0,0,0,0,0,0,0,0,0,0,0,0,0,0,0,0,0,0,0,0,0,0,0,0,0,0,0]
[9,0,0,0,0,0,0,0,0,0,0,0,0,0,0,0,0,0,0,0,0,0,0,0,0,0,0,0,0,0,0,0,0,0,0,0,0,0,0,0,0,0,0,0,0,0,0,0,0,0,0,0,0,0,0,0,0,0]
[10,0,0,0,0,0,0,0,0,0,0,0,0,0,0,0,0,0,0,0,0,0,0,0,0,0,0,0,0,0,0,0,0,0,0,0,0,0,0,0,0,0,0,0,0,0,0,0,0,0,0,0,0,0,0,0,0,0]
[11,0,0,0,0,0,0,0,0,0,0,0,0,0,0,0,0,0,0,0,0,0,0,0,0,0,0,0,0,0,0,0,0,0,0,0,0,0,0,0,0,0,0,0,0,0,0,0,0,0,0,0,0,0,0,0,0,0]
[12,0,0,0,0,0,0,0,0,0,0,0,0,0,0,0,0,0,0,0,0,0,0,0,0,0,0,0,0,0,0,0,0,0,0,0,0,0,0,0,0,0,0,0,0,0,0,0,0,0,0,0,0,0,0,0,0,0]
["Total general",0,0,0,0,0,0,0,0,0,0,0,0,0,0,0,0,0,0,0,0,0,0,0,0,0,0,0,2,0,0,0,0,0,0,0,0,0,0,0,0,0,0,0,0,0,0,0,0,0,0,0,0,0,0,0,0,0]
[]
[]
[]
["Anio",2024]
["UE","(Todas)"]
["Red","(Todas)"]
["MicroRed","(Todas)"]
["EESS","(Todas)"]
["Distrito","(Todas)"]
["Provincia","(Todas)"]
[]
["Etiquetas de fila","Suma de Nino_01","Suma de Nino_02","Suma de Nino_03","Suma de Nino_04","Suma de Nino_05","Suma de Nino_06","Suma de Nino_07","Suma de Nino_08","Suma de Nino_09","Suma de Nino_10","Suma de Nino_100","Suma de Nino_101","Suma de Nino_102","Suma de Nino_103","Suma de Nino_104","Suma de Nino_105","Suma de Nino_106","Suma de Nino_107","Suma de Nino_108","Suma de Nino_109","Suma de Nino_11","Suma de Nino_110","Suma de Nino_111","Suma de Nino_112","Suma de Nino_113","Suma de Nino_114","Suma de Nino_115","Suma de Nino_116","Suma de Nino_117","Suma de Nino_118","Suma de Nino_119","Suma de Nino_12","Suma de Nino_120","Suma de Nino_121","Suma de Nino_122","Suma de Nino_123","Suma de Nino_124","Suma de Nino_125","Suma de Nino_127","Suma de Nino_128","Suma de Nino_126","Suma de Nino_129","Suma de Nino_13","Suma de Nino_130","Suma de Nino_132","Suma de Nino_131","Suma de Nino_133","Suma de Nino_134","Suma de Nino_135","Suma de Nino_136","Suma de Nino_137","Suma de Nino_138","Suma de Nino_139","Suma de Nino_14","Suma de Nino_140","Suma de Nino_141","Suma de Nino_142","Suma de Nino_143","Suma de Nino_150","Suma de Nino_15","Suma de Nino_16","Suma de Nino_17","Suma de Nino_18","Suma de Nino_19","Suma de Nino_20","Suma de Nino_21","Suma de Nino_22","Suma de Nino_23","Suma de Nino_24","Suma de Nino_25","Suma de Nino_26","Suma de Nino_27","Suma de Nino_28","Suma de Nino_29","Suma de Nino_30","Suma de Nino_31","Suma de Nino_32","Suma de Nino_33","Suma de Nino_34","Suma de Nino_35","Suma de Nino_36","Suma de Nino_37","Suma de Nino_38","Suma de Nino_39","Suma de Nino_40","Suma de Nino_41","Suma de Nino_43","Suma de Nino_42","Suma de Nino_44","Suma de Nino_45","Suma de Nino_46","Suma de Nino_47","Suma de Nino_48","Suma de Nino_49","Suma de Nino_50","Suma de Nino_51","Suma de Nino_52","Suma de Nino_53","Suma de Nino_54","Suma de Nino_55","Suma de Nino_56","Suma de Nino_57","Suma de Nino_58","Suma de Nino_59","Suma de Nino_60","Suma de Nino_61","Suma de Nino_62","Suma de Nino_63","Suma de Nino_64","Suma de Nino_65","Suma de Nino_66","Suma de Nino_67","Suma de Nino_68","Suma de Nino_69","Suma de Nino_70","Suma de Nino_71","Suma de Nino_72","Suma de Nino_73","Suma de Nino_74","Suma de Nino_75","Suma de Nino_76","Suma de Nino_79","Suma de Nino_77","Suma de Nino_78","Suma de Nino_80","Suma de Nino_81","Suma de Nino_83","Suma de Nino_84","Suma de Nino_82","Suma de Nino_85","Suma de Nino_87","Suma de Nino_88","Suma de Nino_86","Suma de Nino_89","Suma de Nino_91","Suma de Nino_92","Suma de Nino_90","Suma de Nino_93","Suma de Nino_94","Suma de Nino_95","Suma de Nino_96","Suma de Nino_97","Suma de Nino_98","Suma de Nino_99","Suma de Nino_144","Suma de Nino_145","Suma de Nino_146","Suma de Nino_147","Suma de Nino_148","Suma de Nino_149","Suma de Nino_151","Suma de Nino_152","Suma de Nino_153","Suma de Nino_154","Suma de Nino_155","Suma de Nino_156","Suma de Nino_157","Suma de Nino_158","Suma de Nino_159","Suma de Nino_160","Suma de Nino_161","Suma de Nino_162","Suma de Nino_163","Suma de Nino_164","Suma de Nino_165","Suma de Nino_166","Suma de Nino_167","Suma de Nino_170","Suma de Nino_171","Suma de Nino_172","Suma de Nino_173","Suma de Nino_174","Suma de Nino_175","Suma de Nino_168","Suma de Nino_169"]
[1,0,0,0,0,0,0,0,0,0,0,0,0,0,0,0,0,0,0,0,0,0,0,0,0,0,0,0,0,0,0,0,0,0,0,0,0,0,0,0,0,0,0,0,0,0,0,0,0,0,0,0,0,0,0,0,0,0,0,0,0,0,0,0,0,0,0,0,0,0,0,0,0,0,0,0,0,0,12,0,0,0,5,0,0,0,2,0,0,0,0,0,0,0,3,2,0,0,1,0,0,0,0,0,0,0,0,0,0,0,0,0,0,0,0,0,0,0,0,0,0,0,0,0,0,0,0,0,0,0,0,0,0,0,0,0,0,0,0,0,0,0,0,0,0,0,0,0,0,0,0,0,0,0,0,0,0,0,0,0,0,0,0,0,0,0,0,0,0,0,0,0,0,0,0,0]
[2,0,0,0,0,0,0,0,0,0,0,0,0,0,0,0,0,0,0,0,0,0,0,0,0,0,0,0,0,0,0,0,0,0,0,0,0,0,0,0,0,0,0,0,0,0,0,0,0,0,0,0,0,0,0,0,0,0,0,0,0,0,0,0,0,0,0,0,0,0,0,0,0,0,0,0,0,0,2,0,0,0,2,0,0,0,0,0,0,0,0,0,0,0,4,2,0,0,0,0,0,0,0,0,0,0,0,0,0,0,0,0,0,0,0,0,0,0,0,0,0,0,0,0,0,0,0,0,0,0,0,0,0,0,0,0,0,0,0,0,0,0,0,0,0,0,0,0,0,0,0,0,0,0,0,0,0,0,0,0,0,0,0,0,0,0,0,0,0,0,0,0,0,0,0,0]
[3,0,0,0,14,0,0,14,0,0,0,0,0,0,0,0,0,0,0,0,0,0,0,0,0,0,0,0,0,0,0,0,0,0,0,0,0,0,0,0,0,0,0,0,0,0,0,0,0,0,0,0,0,0,0,0,0,0,0,0,0,0,0,0,0,0,0,0,0,0,0,0,0,0,0,0,0,0,7,4,0,0,7,4,0,0,0,0,0,0,0,0,0,0,6,0,0,0,0,0,0,0,0,0,0,0,0,0,0,0,0,0,0,0,0,0,0,0,0,0,0,0,0,0,0,0,0,0,0,0,0,0,0,0,0,0,0,0,0,0,0,0,0,0,0,0,0,0,0,0,0,0,0,0,0,0,0,0,0,0,0,0,0,0,0,0,0,0,0,0,0,0,0,0,0,0]
[4,0,0,0,6,0,0,6,0,0,0,0,0,0,0,0,0,0,0,0,0,0,0,0,0,0,0,0,0,0,0,0,0,0,0,0,0,1,36,0,0,0,0,0,0,0,0,0,0,0,0,0,0,0,0,0,0,0,0,0,0,0,0,0,0,0,0,0,0,0,0,0,0,0,0,0,0,0,3,0,0,0,3,0,0,0,0,0,0,0,0,0,0,0,2,1,0,0,0,0,0,0,0,0,0,0,0,0,0,0,0,0,0,0,0,0,0,0,0,0,0,0,0,0,0,0,0,0,0,0,0,0,0,0,0,0,0,0,0,0,0,0,0,0,0,0,0,0,0,0,0,0,0,0,0,0,0,0,0,0,0,0,0,0,0,0,0,0,0,0,0,0,0,0,0,0]
[5,0,0,0,0,0,0,0,0,0,0,0,0,0,0,0,0,0,0,0,0,0,0,0,0,0,0,0,0,0,0,0,0,0,0,0,0,0,0,0,0,0,0,0,0,0,0,0,0,0,0,0,1,0,0,0,0,0,0,0,0,0,0,0,0,0,0,0,0,0,0,13,2,0,0,0,0,0,6,3,0,0,6,2,0,0,0,0,0,0,0,0,0,0,7,0,0,0,1,0,0,0,0,0,0,0,0,0,0,0,0,0,0,0,0,0,0,0,0,0,0,0,0,0,0,0,0,0,0,0,0,0,0,0,0,0,0,0,0,0,0,0,0,0,0,0,0,0,0,0,0,0,0,0,0,0,0,0,0,0,0,0,0,0,0,0,0,0,0,0,0,0,0,0,0,0]
[6,0,0,0,0,0,0,0,0,0,0,0,0,0,0,0,0,0,0,0,0,0,0,0,0,0,0,0,0,0,0,0,0,0,0,0,0,1,37,0,0,0,0,0,0,0,0,0,0,0,0,0,0,0,0,0,0,0,0,0,0,0,0,0,0,0,0,0,0,0,0,4,4,0,0,0,0,0,0,0,0,0,0,0,0,0,0,0,0,0,0,0,0,0,6,0,0,0,0,1,1,0,0,0,0,0,0,0,0,0,0,0,0,0,0,0,0,0,0,0,0,0,0,0,0,0,0,0,0,0,0,0,0,0,0,0,0,0,0,0,0,0,0,0,0,0,0,0,0,0,0,0,0,0,0,0,0,0,0,0,0,0,0,0,0,0,0,0,0,0,0,0,0,0,0,0]
[7,0,0,0,0,0,0,0,0,0,0,0,0,0,0,0,0,0,0,0,0,0,0,0,0,0,0,0,0,0,0,0,0,0,0,0,0,0,0,0,0,0,0,0,0,0,0,0,0,0,0,0,5,1,0,0,0,6,2,0,0,0,0,0,0,0,0,0,0,8,0,6,6,0,0,0,0,0,7,1,0,0,4,1,0,0,1,0,0,0,0,0,0,0,8,1,0,0,6,2,0,0,0,0,0,0,0,0,0,0,0,0,0,0,0,0,0,0,0,0,0,0,0,0,0,0,0,0,0,0,0,0,0,0,0,6,3,3,6,3,31,0,0,0,0,0,0,0,0,0,0,1,0,0,0,0,0,0,0,0,3,31,0,0,3,31,0,0,0,0,3,31,0,0,3,31]
[8,0,0,0,0,0,0,0,0,0,0,0,0,1,10,1,15,0,0,0,0,0,0,0,0,0,0,0,0,0,0,0,0,0,0,0,0,0,0,0,0,0,0,0,0,0,0,0,0,0,0,0,11,9,0,0,0,7,2,0,0,0,0,0,0,0,0,0,1,10,0,9,1,0,0,0,0,0,8,2,0,0,8,2,0,0,0,0,0,0,0,0,0,0,13,9,0,0,8,2,5,0,0,0,1,0,0,1,0,2,0,0,0,0,0,0,0,0,0,0,0,0,0,0,0,0,0,0,0,0,0,0,0,0,0,16,3,4,6,2,30,0,0,0,0,5,0,0,0,1,0,1,0,2,0,0,0,0,0,0,2,30,0,0,2,30,0,0,0,0,2,30,0,0,2,30]
[9,0,0,0,7,7,0,14,0,0,0,0,0,0,0,0,0,0,0,0,0,0,0,0,0,0,0,0,0,0,0,0,0,0,0,0,0,0,0,0,0,0,0,0,0,0,0,0,0,0,0,0,3,0,0,0,0,1,0,0,0,0,0,0,0,0,0,0,0,0,0,3,7,0,0,0,0,0,4,0,0,0,4,0,0,0,0,0,0,0,0,0,0,0,6,6,0,0,2,2,0,0,0,0,0,0,0,0,0,0,0,0,0,0,0,0,0,0,0,0,0,0,0,0,0,0,0,0,0,0,0,0,0,0,0,0,0,0,0,0,0,0,0,0,0,0,0,0,0,0,0,0,0,0,0,0,0,0,0,0,0,0,0,0,0,0,0,0,0,0,0,0,0,0,0,0]
[10,0,0,0,3,4,0,7,0,0,0,0,0,0,0,0,0,0,0,0,0,0,0,0,0,0,0,0,0,0,0,0,0,0,0,0,0,0,0,0,0,0,0,0,0,0,0,0,0,0,0,0,4,0,0,0,0,3,0,0,0,0,0,0,0,0,0,0,0,0,0,12,7,0,0,0,0,0,3,1,0,0,3,1,0,0,0,0,0,0,0,0,0,0,5,2,0,0,3,0,0,0,0,0,0,0,0,0,0,0,0,0,0,0,0,0,0,0,0,0,0,0,0,0,0,0,0,0,0,0,0,0,0,0,0,0,0,0,0,0,0,0,0,0,0,0,0,0,0,0,0,0,0,0,0,0,0,0,0,0,0,0,0,0,0,0,0,0,0,0,0,0,0,0,0,0]
[11,0,0,0,0,0,0,0,0,0,0,0,0,0,0,0,0,0,0,0,0,0,0,0,0,0,0,0,0,0,0,0,0,0,0,0,0,0,0,0,0,0,0,0,0,0,0,0,0,0,0,0,8,0,0,0,0,3,0,0,0,0,0,0,0,0,0,0,0,0,0,6,19,0,0,1,0,14,7,9,0,0,6,8,0,0,1,0,0,0,0,0,0,0,8,1,0,0,2,0,0,0,0,0,0,0,0,0,0,0,0,0,0,0,0,0,0,0,0,0,0,0,0,0,0,0,0,0,0,0,0,0,0,0,0,4,2,2,4,2,25,0,0,0,0,0,0,0,0,0,0,0,0,0,0,0,0,0,0,0,2,25,0,0,2,25,0,0,0,0,2,25,0,0,2,25]
[12,0,0,0,5,3,0,8,0,0,0,0,0,1,25,0,0,0,0,0,0,0,0,0,0,0,0,0,0,0,0,0,0,0,0,0,0,0,0,0,0,0,0,0,0,0,0,0,0,0,0,0,2,0,0,0,0,1,0,0,0,0,0,0,0,0,0,0,0,0,0,12,5,0,0,0,0,0,7,3,0,0,7,3,0,0,0,0,0,0,0,0,0,0,1,0,0,0,3,0,3,0,0,0,0,1,0,0,0,0,0,0,0,0,0,0,0,0,0,0,0,0,0,0,0,0,0,0,0,0,0,0,0,0,0,0,0,0,0,0,0,0,0,0,0,2,0,0,0,0,1,0,0,0,0,0,0,0,0,0,0,0,0,0,0,0,0,0,0,0,0,0,0,0,0,0]
["Total general",0,0,0,35,14,0,49,0,0,0,0,0,2,35,1,15,0,0,0,0,0,0,0,0,0,0,0,0,0,0,0,0,0,0,0,0,2,73,0,0,0,0,0,0,0,0,0,0,0,0,0,34,10,0,0,0,21,4,0,0,0,0,0,0,0,0,0,1,18,0,65,51,0,0,1,0,14,66,23,0,0,55,21,0,0,4,0,0,0,0,0,0,0,69,24,0,0,26,7,9,0,0,0,1,1,0,1,0,2,0,0,0,0,0,0,0,0,0,0,0,0,0,0,0,0,0,0,0,0,0,0,0,0,0,26,8,9,16,7,86,0,0,0,0,7,0,0,0,1,1,2,0,2,0,0,0,0,0,0,7,86,0,0,7,86,0,0,0,0,7,86,0,0,7,86]
[]
[]
["Metax1 "]
["Anio",2024]
["UE","(Todas)"]
["Red","(Todas)"]
["EESS","(Todas)"]
["Provincia","(Todas)"]
["Distrito","(Todas)"]
["MicroRed","(Todas)"]
[]
["Etiquetas de fila","Suma de metax01","Suma de metax02","Suma de metax03","Suma de metax04","Suma de metax05","Suma de metax06","Suma de metax07","Suma de metax08","Suma de metax09","Suma de metax10","Suma de metax100","Suma de metax101","Suma de metax102","Suma de metax103","Suma de metax104","Suma de metax105","Suma de metax106","Suma de metax107","Suma de metax108","Suma de metax109","Suma de metax11","Suma de metax110","Suma de metax111","Suma de metax112","Suma de metax113","Suma de metax114","Suma de metax115","Suma de metax116","Suma de metax117","Suma de metax118","Suma de metax119","Suma de metax12","Suma de metax120","Suma de metax121","Suma de metax122","Suma de metax123","Suma de metax124","Suma de metax125","Suma de metax126","Suma de metax127","Suma de metax128","Suma de metax129","Suma de metax13","Suma de metax130","Suma de metax131","Suma de metax132","Suma de metax133","Suma de metax134","Suma de metax135","Suma de metax136","Suma de metax137","Suma de metax138","Suma de metax139","Suma de metax14","Suma de metax140","Suma de metax145","Suma de metax141","Suma de metax142","Suma de metax143","Suma de metax144","Suma de metax146","Suma de metax147","Suma de metax148","Suma de metax149","Suma de metax15","Suma de metax150","Suma de metax151","Suma de metax152","Suma de metax153","Suma de metax154","Suma de metax155","Suma de metax156","Suma de metax157","Suma de metax158","Suma de metax159","Suma de metax16","Suma de metax160","Suma de metax161","Suma de metax162","Suma de metax163","Suma de metax164","Suma de metax165","Suma de metax166","Suma de metax167","Suma de metax168","Suma de metax169","Suma de metax17","Suma de metax170","Suma de metax171","Suma de metax172","Suma de metax173","Suma de metax174","Suma de metax175","Suma de metax176","Suma de metax177","Suma de metax178","Suma de metax179","Suma de metax18","Suma de metax180","Suma de metax181","Suma de metax182","Suma de metax183","Suma de metax184","Suma de metax185","Suma de metax186","Suma de metax187","Suma de metax188","Suma de metax189","Suma de metax19","Suma de metax190","Suma de metax191","Suma de metax192","Suma de metax193","Suma de metax194","Suma de metax195","Suma de metax196","Suma de metax197","Suma de metax198","Suma de metax199","Suma de metax20","Suma de metax200","Suma de metax201","Suma de metax202","Suma de metax203","Suma de metax204","Suma de metax205","Suma de metax206","Suma de metax207","Suma de metax208","Suma de metax209","Suma de metax21","Suma de metax210","Suma de metax211","Suma de metax213","Suma de metax212","Suma de metax214","Suma de metax215","Suma de metax216","Suma de metax217","Suma de metax218","Suma de metax219","Suma de metax22","Suma de metax220","Suma de metax221","Suma de metax222","Suma de metax223","Suma de metax224","Suma de metax225","Suma de metax226","Suma de metax227","Suma de metax228","Suma de metax229","Suma de metax23","Suma de metax230","Suma de metax231","Suma de metax232","Suma de metax233","Suma de metax234","Suma de metax235","Suma de metax236","Suma de metax237","Suma de metax238","Suma de metax239","Suma de metax24","Suma de metax240","Suma de metax241","Suma de metax242","Suma de metax243","Suma de metax244","Suma de metax245","Suma de metax246","Suma de metax247","Suma de metax248","Suma de metax249","Suma de metax25","Suma de metax250","Suma de metax26","Suma de metax27","Suma de metax28","Suma de metax29","Suma de metax30","Suma de metax31","Suma de metax32","Suma de metax33","Suma de metax34","Suma de metax35","Suma de metax36","Suma de metax37","Suma de metax38","Suma de metax39","Suma de metax40","Suma de metax41","Suma de metax42","Suma de metax43","Suma de metax44","Suma de metax45","Suma de metax46","Suma de metax47","Suma de metax48","Suma de metax49","Suma de metax50","Suma de metax51","Suma de metax52","Suma de metax53","Suma de metax54","Suma de metax55","Suma de metax56","Suma de metax57","Suma de metax58","Suma de metax59","Suma de metax60","Suma de metax61","Suma de metax62","Suma de metax63","Suma de metax64","Suma de metax65","Suma de metax66","Suma de metax67","Suma de metax68","Suma de metax69","Suma de metax70","Suma de metax71","Suma de metax72","Suma de metax73","Suma de metax74","Suma de metax75","Suma de metax76","Suma de metax77","Suma de metax78","Suma de metax79","Suma de metax80","Suma de metax81","Suma de metax83","Suma de metax84","Suma de metax82","Suma de metax85","Suma de metax86","Suma de metax87","Suma de metax88","Suma de metax89","Suma de metax90","Suma de metax91","Suma de metax92","Suma de metax93","Suma de metax94","Suma de metax95","Suma de metax96","Suma de metax97","Suma de metax98","Suma de metax99","Suma de metax_124","Suma de metax_125","Suma de metax_126","Suma de metax_127","Suma de metax_76","Suma de metax_77"]
[1,0,0,0,0,0,0,0,0,0,0,0,0,0,0,0,0,0,0,0,0,0,0,0,0,0,0,0,0,0,0,0,0,0,0,0,0,0,0,0,0,0,0,0,0,0,0,0,0,0,0,0,0,0,0,0,0,0,0,0,0,0,0,0,0,0,0,0,0,0,0,0,0,0,0,0,0,0,0,0,0,0,0,0,0,0,0,0,0,0,0,0,0,0,0,0,0,0,0,0,0,0,0,0,0,0,0,0,0,0,0,0,0,0,0,0,0,0,0,0,0,0,0,0,0,0,0,0,0,0,0,0,0,0,0,0,0,0,0,0,0,0,0,0,0,0,0,0,0,0,0,0,0,0,0,0,0,0,0,0,0,0,0,0,0,0,0,0,0,0,0,0,0,0,0,0,0,0,0,0,0,0,0,0,0,0,0,0,0,0,0,0,0,0,0,0,0,0,0,0,0,0,0,0,0,0,0,0,0,0,0,0,0,0,0,0,0,0,0,0,0,0,0,0,0,0,0,0,0,0,0,0,0,0,0,0,0,0,0,0,0,0,0,0,0,0,0,0,0,0,0,0,0,0,0,0,0]
[2,0,0,0,0,0,0,0,0,0,0,0,0,0,0,0,0,0,0,0,0,0,0,0,0,0,0,0,0,0,0,0,0,0,0,0,0,0,0,0,0,0,0,0,0,0,0,0,0,0,0,0,0,0,0,0,0,0,0,0,0,0,0,0,0,0,0,0,0,0,0,0,0,0,0,0,0,0,0,0,0,0,0,0,0,0,0,0,0,0,0,0,0,0,0,0,0,0,0,0,0,0,0,0,0,0,0,0,0,0,0,0,0,0,0,0,0,0,0,0,0,0,0,0,0,0,0,0,0,0,0,0,0,0,0,0,0,0,0,0,0,0,0,0,0,0,0,0,0,0,0,0,0,0,0,0,0,0,0,0,0,0,0,0,0,0,0,0,0,0,0,0,0,0,0,0,0,0,0,0,0,0,0,0,0,0,0,0,0,0,0,0,0,0,0,0,0,0,0,0,0,0,0,0,0,0,0,0,0,0,0,0,0,0,0,0,0,0,0,0,0,0,0,0,0,0,0,0,0,0,0,0,0,0,0,0,0,0,0,0,0,0,0,0,0,0,0,0,0,0,0,0,0,0,0,0,0]
[3,0,0,0,0,0,0,0,0,0,0,0,0,0,0,0,0,0,0,0,0,0,0,0,0,0,0,0,0,0,0,0,0,0,0,0,0,0,0,0,0,0,0,0,0,0,0,0,0,0,0,0,0,0,0,0,0,0,0,0,0,0,0,0,0,0,0,0,0,0,0,0,0,0,0,0,0,0,0,0,0,0,0,0,0,0,0,0,0,0,0,0,0,0,0,0,0,0,0,0,0,0,0,0,0,0,0,0,0,0,0,0,0,0,0,0,0,0,0,0,0,0,0,0,0,0,0,0,0,0,0,0,0,0,0,0,0,0,0,0,0,0,0,0,0,0,0,0,0,0,0,0,0,0,0,0,0,0,0,0,0,0,0,0,0,0,0,0,0,0,0,0,0,0,0,0,0,0,0,0,0,0,0,0,0,0,0,0,0,0,0,0,0,0,0,0,0,0,0,0,0,0,0,0,0,0,0,0,0,0,0,0,0,0,0,0,0,0,0,0,0,0,0,0,0,0,0,0,0,0,0,0,0,0,0,0,0,0,0,0,0,0,0,0,0,0,0,0,0,0,0,0,0,0,0,0,0]
[4,0,0,0,0,0,0,0,0,0,0,0,0,0,0,0,0,0,0,0,0,0,0,0,0,0,0,0,0,0,0,0,0,0,0,0,0,0,0,0,0,0,0,0,0,0,0,0,0,0,0,0,0,0,0,0,0,0,0,0,0,0,0,0,0,0,0,0,0,0,0,0,0,0,0,0,0,0,0,0,0,0,0,0,0,0,0,0,0,0,0,0,0,0,0,0,0,0,0,0,0,0,0,0,0,0,0,0,0,0,0,0,0,0,0,0,0,0,0,0,0,0,0,0,0,0,0,0,0,0,0,0,0,0,0,0,0,0,0,0,0,0,0,0,0,0,0,0,0,0,0,0,0,0,0,0,0,0,0,0,0,0,0,0,0,0,0,0,0,0,0,0,0,0,0,0,0,0,0,0,0,0,0,0,0,0,0,0,0,0,0,0,0,0,0,0,0,0,0,0,0,0,0,0,0,0,0,0,0,0,0,0,0,0,0,0,0,0,0,0,0,0,0,0,0,0,0,0,0,0,0,0,0,0,0,0,0,0,0,0,0,0,0,0,0,0,0,0,0,0,0,0,0,0,0,0,0]
[5,0,0,0,0,0,0,0,0,0,0,0,0,0,0,0,0,0,0,0,0,0,0,0,0,0,0,0,0,0,0,0,0,0,0,0,0,0,0,0,0,0,0,0,0,0,0,0,0,0,0,0,0,0,0,0,0,0,0,0,0,0,0,0,0,0,0,0,0,0,0,0,0,0,0,0,0,0,0,0,0,0,0,0,0,0,0,0,0,0,0,0,0,0,0,0,0,0,0,0,0,0,0,0,0,0,0,0,0,0,0,0,0,0,0,0,0,0,0,0,0,0,0,0,0,0,0,0,0,0,0,80,0,0,0,0,0,0,0,0,0,0,0,0,0,0,0,0,0,0,0,0,0,0,0,0,0,0,0,0,0,0,0,0,0,0,0,0,0,0,0,0,0,0,0,0,0,0,0,0,0,0,0,0,0,0,0,0,0,0,0,0,0,0,0,0,0,0,0,0,0,0,0,0,0,0,0,0,0,0,0,0,0,0,0,0,0,0,0,0,0,0,0,0,0,0,0,0,0,0,0,0,0,0,0,0,0,0,0,0,0,0,0,0,0,0,0,0,0,0,0,0,0,0,0,0,0]
[6,0,0,0,0,0,0,0,78,0,0,0,0,0,0,0,0,0,0,0,0,0,0,0,0,0,0,0,0,0,0,0,0,0,0,0,0,0,0,0,0,0,0,0,0,0,0,0,0,0,0,0,0,0,0,0,0,0,0,0,0,0,0,0,0,0,0,0,0,0,0,0,0,0,0,0,78,0,0,0,0,0,0,0,0,0,0,0,0,0,0,0,0,0,0,0,0,0,0,0,0,0,0,0,0,0,0,0,0,78,0,0,0,0,0,0,0,0,0,0,0,0,0,0,0,0,0,0,0,0,0,0,0,0,0,0,0,0,0,0,0,0,0,0,0,0,0,0,0,0,0,0,0,0,0,0,0,0,0,0,0,0,0,0,0,0,0,0,0,0,0,0,0,0,0,0,0,79,0,0,0,0,79,0,0,0,0,0,0,0,0,0,0,0,0,0,0,0,0,0,0,0,0,0,0,0,0,0,0,0,0,0,0,0,0,0,0,0,0,0,0,0,0,0,0,0,0,0,0,0,0,0,0,0,0,0,0,0,0,0,0,0,0,0,0,0,0,0,0,0,0,0,0,0,0,0,0]
[7,0,0,0,0,0,0,0,0,0,0,0,0,0,0,0,0,0,0,0,0,0,0,0,0,0,0,0,0,0,0,0,0,0,0,0,0,0,0,0,0,0,0,0,0,0,0,0,0,0,0,0,0,0,0,0,0,0,0,0,0,0,0,0,0,0,0,0,0,0,0,0,0,0,0,0,0,0,0,0,0,0,0,0,0,0,0,0,0,0,0,0,0,0,0,0,0,0,0,0,0,0,0,0,0,0,0,0,0,0,0,0,0,0,0,0,0,0,0,0,0,0,0,0,0,0,0,0,0,0,0,0,0,0,0,0,0,0,0,0,0,0,0,0,0,0,0,0,0,0,0,0,0,0,0,0,0,0,0,0,0,0,0,0,0,0,0,0,0,0,0,0,0,0,0,0,0,0,0,0,0,0,0,0,0,0,0,0,0,0,0,0,0,0,0,0,0,0,0,0,0,0,0,0,0,0,0,0,0,0,0,0,0,0,0,0,0,0,0,0,0,0,0,0,0,0,0,0,0,0,0,0,0,0,0,0,0,0,0,0,0,0,0,0,0,0,0,0,0,0,0,0,0,0,0,0,0]
[8,0,0,0,0,0,0,0,0,0,0,0,0,0,0,0,0,0,0,0,0,0,0,0,0,0,0,0,0,0,0,0,0,0,0,0,0,0,0,0,0,0,0,0,0,0,0,0,0,0,0,0,0,0,0,0,0,0,0,0,0,0,0,0,0,0,0,0,0,0,0,0,0,0,0,0,0,0,0,0,0,0,0,0,0,0,0,0,0,0,0,0,0,0,0,0,0,0,0,0,0,0,0,0,0,0,0,0,0,0,0,0,0,0,0,0,0,0,0,0,0,0,0,0,0,0,0,0,0,0,0,0,0,0,0,0,0,0,0,0,0,0,0,0,0,0,0,0,0,0,0,0,0,0,0,0,0,0,0,0,0,0,0,0,0,0,0,0,0,0,0,0,0,0,0,0,0,0,0,0,0,0,0,0,0,0,0,0,0,0,0,0,0,0,0,0,0,0,0,0,0,0,0,0,0,0,0,0,0,0,0,0,0,0,0,0,0,0,0,0,0,0,0,0,0,0,0,0,0,0,0,0,0,0,0,0,0,0,0,0,0,0,0,0,0,0,0,0,0,0,0,0,0,0,0,0,0]
[9,0,0,0,0,0,0,0,0,0,0,0,0,0,0,0,0,0,0,0,0,0,0,0,0,0,0,0,0,0,0,0,0,0,0,0,0,0,0,0,0,0,0,0,0,0,0,0,0,0,0,0,0,0,0,0,0,0,0,0,0,0,0,0,0,0,0,0,0,0,0,0,0,0,0,0,0,0,0,0,0,0,0,0,0,0,0,0,0,0,0,0,0,0,0,0,0,0,0,0,0,0,0,0,0,0,0,0,0,0,0,0,0,0,0,0,0,0,0,0,0,0,0,0,0,0,0,0,0,0,0,0,0,0,0,0,0,0,0,0,0,0,0,0,0,0,0,0,0,0,0,0,0,0,0,0,0,0,0,0,0,0,0,0,0,0,0,0,0,0,0,0,0,0,0,0,0,0,0,0,0,0,0,0,0,0,0,0,0,0,0,0,0,0,0,0,0,0,0,0,0,0,0,0,0,0,0,0,0,0,0,0,0,0,0,0,0,0,0,0,0,0,0,0,0,0,0,0,0,0,0,0,0,0,0,0,0,0,0,0,0,0,0,0,0,0,0,0,0,0,0,0,0,0,0,0,0]
[10,0,0,0,0,0,0,0,0,0,0,0,0,0,0,0,0,0,0,0,0,0,0,0,0,0,0,0,0,0,0,0,0,0,0,0,0,0,0,0,0,0,0,0,0,0,0,0,0,0,0,0,0,0,0,0,0,0,0,0,0,0,0,0,0,0,0,0,0,0,0,0,0,0,0,0,0,0,0,0,0,0,0,0,0,0,0,0,0,0,0,0,0,0,0,0,0,0,0,0,0,0,0,0,0,0,0,0,0,0,0,0,0,0,0,0,0,0,0,0,0,0,0,0,0,0,0,0,0,0,0,0,0,0,0,0,0,0,0,0,0,0,0,0,0,0,0,0,0,0,0,0,0,0,0,0,0,0,0,0,0,0,0,0,0,0,0,0,0,0,0,0,0,0,0,0,0,0,0,0,0,0,0,0,0,0,0,0,0,0,0,0,0,0,0,0,0,0,0,0,0,0,0,0,0,0,0,0,0,0,0,0,0,0,0,0,0,0,0,0,0,0,0,0,0,0,0,0,0,0,0,0,0,0,0,0,0,0,0,0,0,0,0,0,0,0,0,0,0,0,0,0,0,0,0,0,0]
[11,0,0,0,0,0,0,0,0,0,0,0,0,0,0,0,0,0,0,0,0,0,0,0,0,0,0,0,0,0,0,0,0,0,0,0,0,0,0,0,0,0,0,0,0,0,0,0,0,0,0,0,0,0,0,0,0,0,0,0,0,0,0,0,0,0,0,0,0,0,0,0,0,0,0,0,0,0,0,0,0,0,0,0,0,0,0,0,0,0,0,0,0,0,0,0,0,0,0,0,0,0,0,0,0,0,0,0,0,0,0,0,0,0,0,0,0,0,0,0,0,0,0,0,0,0,0,0,0,0,0,0,0,0,0,0,0,0,0,0,0,0,0,0,0,0,0,0,0,0,0,0,0,0,0,0,0,0,0,0,0,0,0,0,0,0,0,0,0,0,0,0,0,0,0,0,0,0,0,0,0,0,0,0,0,0,0,0,0,0,0,0,0,0,0,0,0,0,0,0,0,0,0,0,0,0,0,0,0,0,0,0,0,0,0,0,0,0,0,0,0,0,0,0,0,0,0,0,0,0,0,0,0,0,0,0,0,0,0,0,0,0,0,0,0,0,0,0,0,0,0,0,0,0,0,0,0]
[12,0,0,0,0,0,0,0,0,0,0,0,0,0,0,0,0,0,0,0,0,0,0,0,0,0,0,0,0,0,0,0,0,0,0,0,0,0,0,0,0,0,0,0,0,0,0,0,0,0,0,0,0,0,0,0,0,0,0,0,0,0,0,0,0,0,0,0,0,0,0,0,0,0,0,0,0,0,0,0,0,0,0,0,0,0,0,0,0,0,0,0,0,0,0,0,0,0,0,0,0,0,0,0,0,0,0,0,0,0,0,0,0,0,0,0,0,0,0,0,0,0,0,0,0,0,0,0,0,0,0,0,0,0,0,0,0,0,0,0,0,0,0,0,0,0,0,0,0,0,0,0,0,0,0,0,0,0,0,0,0,0,0,0,0,0,0,0,0,0,0,0,0,0,0,0,0,0,0,0,0,0,0,0,0,0,0,0,0,0,0,0,0,0,0,0,0,0,0,0,0,0,0,0,0,0,0,0,0,0,0,0,0,0,0,0,0,0,0,0,0,0,0,0,0,0,0,0,0,0,0,0,0,0,0,0,0,0,0,0,0,0,0,0,0,0,0,0,0,0,0,0,0,0,0,0,0]
["Total general",0,0,0,0,0,0,0,78,0,0,0,0,0,0,0,0,0,0,0,0,0,0,0,0,0,0,0,0,0,0,0,0,0,0,0,0,0,0,0,0,0,0,0,0,0,0,0,0,0,0,0,0,0,0,0,0,0,0,0,0,0,0,0,0,0,0,0,0,0,0,0,0,0,0,0,78,0,0,0,0,0,0,0,0,0,0,0,0,0,0,0,0,0,0,0,0,0,0,0,0,0,0,0,0,0,0,0,0,78,0,0,0,0,0,0,0,0,0,0,0,0,0,0,0,0,0,0,0,0,0,80,0,0,0,0,0,0,0,0,0,0,0,0,0,0,0,0,0,0,0,0,0,0,0,0,0,0,0,0,0,0,0,0,0,0,0,0,0,0,0,0,0,0,0,0,0,79,0,0,0,0,79,0,0,0,0,0,0,0,0,0,0,0,0,0,0,0,0,0,0,0,0,0,0,0,0,0,0,0,0,0,0,0,0,0,0,0,0,0,0,0,0,0,0,0,0,0,0,0,0,0,0,0,0,0,0,0,0,0,0,0,0,0,0,0,0,0,0,0,0,0,0,0,0,0,0]
[]
[]
[]
[]
[]
[]
[]
[]
[]
["Anio",2024]
["UE","(Todas)"]
["Red","(Todas)"]
["MicroRed","(Todas)"]
["EESS","(Todas)"]
["Provincia","(Todas)"]
["Distrito","(Todas)"]
[]
["Etiquetas de fila","Suma de metax251","Suma de metax252","Suma de metax253","Suma de metax254","Suma de metax255","Suma de metax256","Suma de metax257","Suma de metax258","Suma de metax259","Suma de metax260","Suma de metax261","Suma de metax262","Suma de metax263","Suma de metax264","Suma de metax265","Suma de metax266","Suma de metax267","Suma de metax268","Suma de metax269","Suma de metax270","Suma de metax271","Suma de metax272","Suma de metax273","Suma de metax274","Suma de metax275","Suma de metax276","Suma de metax277","Suma de metax278","Suma de metax279","Suma de metax280","Suma de metax281","Suma de metax282","Suma de metax283","Suma de metax284","Suma de metax285","Suma de metax286","Suma de metax287","Suma de metax288","Suma de metax289","Suma de metax290","Suma de metax291","Suma de metax292","Suma de metax293","Suma de metax294","Suma de metax295","Suma de metax296","Suma de metax297","Suma de metax298","Suma de metax299","Suma de metax300","Suma de metax301","Suma de metax302","Suma de metax303","Suma de metax304","Suma de metax305","Suma de metax306","Suma de metax307","Suma de metax308","Suma de metax309","Suma de metax310","Suma de metax311","Suma de metax312","Suma de metax313","Suma de metax314","Suma de metax315","Suma de metax316","Suma de metax317","Suma de metax318","Suma de metax319","Suma de metax320","Suma de metax321","Suma de metax322","Suma de metax323","Suma de metax324","Suma de metax325","Suma de metax327","Suma de metax328","Suma de metax326","Suma de metax329","Suma de metax330","Suma de metax331","Suma de metax332","Suma de metax333","Suma de metax334","Suma de metax335","Suma de metax336","Suma de metax337","Suma de metax338","Suma de metax339","Suma de metax340","Suma de metax341","Suma de metax342","Suma de metax343","Suma de metax344","Suma de metax345","Suma de metax346","Suma de metax347","Suma de metax348","Suma de metax349","Suma de metax350","Suma de metax351","Suma de metax352","Suma de metax353","Suma de metax354","Suma de metax355","Suma de metax356","Suma de metax357","Suma de metax358","Suma de metax359","Suma de metax360","Suma de metax361","Suma de metax362","Suma de metax363","Suma de metax364","Suma de metax365","Suma de metax366","Suma de metax367","Suma de metax368","Suma de metax371","Suma de metax369","Suma de metax370","Suma de metax372","Suma de metax373","Suma de metax374","Suma de metax375","Suma de metax376","Suma de metax377","Suma de metax378","Suma de metax379","Suma de metax380","Suma de metax381","Suma de metax382","Suma de metax383","Suma de metax384","Suma de metax385","Suma de metax386","Suma de metax387","Suma de metax388","Suma de metax389","Suma de metax390","Suma de metax391","Suma de metax392","Suma de metax393","Suma de metax396","Suma de metax394","Suma de metax395","Suma de metax397","Suma de metax398","Suma de metax399","Suma de metax400","Suma de metax401","Suma de metax402","Suma de metax403","Suma de metax404","Suma de metax405","Suma de metax406","Suma de metax407","Suma de metax408","Suma de metax409","Suma de metax410","Suma de metax411","Suma de metax412","Suma de metax413","Suma de metax414","Suma de metax415","Suma de metax416","Suma de metax417","Suma de metax418","Suma de metax419","Suma de metax420","Suma de metax421","Suma de metax422","Suma de metax423","Suma de metax424","Suma de metax425","Suma de metax426","Suma de metax427","Suma de metax428","Suma de metax429","Suma de metax430","Suma de metax431","Suma de metax432","Suma de metax433","Suma de metax434","Suma de metax435","Suma de metax436","Suma de metax437","Suma de metax438","Suma de metax439","Suma de metax440","Suma de metax441","Suma de metax442","Suma de metax443","Suma de metax444","Suma de metax445","Suma de metax446","Suma de metax447","Suma de metax448","Suma de metax449","Suma de metax450","Suma de metax451","Suma de metax452","Suma de metax453","Suma de metax454","Suma de metax455","Suma de metax456","Suma de metax457","Suma de metax458","Suma de metax459","Suma de metax460","Suma de metax461","Suma de metax462","Suma de metax463","Suma de metax464","Suma de metax465","Suma de metax466","Suma de metax467","Suma de metax468","Suma de metax469","Suma de metax470","Suma de metax471","Suma de metax472","Suma de metax473","Suma de metax474","Suma de metax475","Suma de metax476","Suma de metax477","Suma de metax478","Suma de metax479","Suma de metax480","Suma de metax481","Suma de metax482","Suma de metax483","Suma de metax484","Suma de metax485","Suma de metax486","Suma de metax487","Suma de metax488","Suma de metax489","Suma de metax490","Suma de metax491","Suma de metax492","Suma de metax493","Suma de metax494","Suma de metax495","Suma de metax496","Suma de metax497","Suma de metax498","Suma de metax499","Suma de metax500"]
[1,0,0,0,0,0,0,0,0,0,0,0,0,0,0,0,0,0,0,0,0,0,0,0,0,0,0,0,0,0,0,0,0,0,0,0,0,0,0,0,0,0,0,0,0,0,0,0,0,0,0,0,0,0,0,0,0,0,0,0,0,0,0,0,0,0,0,0,0,0,0,0,0,0,0,0,0,0,0,0,0,0,0,0,0,0,0,0,0,0,0,0,0,0,0,0,0,0,0,0,0,0,0,0,0,0,0,0,0,0,0,0,0,0,0,0,0,0,0,0,0,0,0,0,0,0,0,0,0,0,0,0,0,0,0,0,0,0,0,0,0,0,0,0,0,0,0,0,0,0,0,0,0,0,0,0,0,0,0,0,0,0,0,0,0,0,0,0,0,0,0,0,0,0,0,0,0,0,0,0,0,0,0,0,0,0,0,0,0,0,0,0,0,0,0,0,0,0,0,0,0,0,0,0,0,0,0,0,0,0,0,0,0,0,0,0,0,0,0,0,0,0,0,0,0,0,0,0,0,0,0,0,0,0,0,0,0,0,0,0,0,0,0,0,0,0,0,0,0,0,0]
[2,0,0,0,0,0,0,0,0,0,0,0,0,0,0,0,0,0,0,0,0,0,0,0,0,0,0,0,0,0,0,0,0,0,0,0,0,0,0,0,0,0,0,0,0,0,0,0,0,0,0,0,0,0,0,0,0,0,0,0,0,0,0,0,0,0,0,0,0,0,0,0,0,0,0,0,0,0,0,0,0,0,0,0,0,0,0,0,0,0,0,0,0,0,0,0,0,0,0,0,0,0,0,0,0,0,0,0,0,0,0,0,0,0,0,0,0,0,0,0,0,0,0,0,0,0,0,0,0,0,0,0,0,0,0,0,0,0,0,0,0,0,0,0,0,0,0,0,0,0,0,0,0,0,0,0,0,0,0,0,0,0,0,0,0,0,0,0,0,0,0,0,0,0,0,0,0,0,0,0,0,0,0,0,0,0,0,0,0,0,0,0,0,0,0,0,0,0,0,0,0,0,0,0,0,0,0,0,0,0,0,0,0,0,0,0,0,0,0,0,0,0,0,0,0,0,0,0,0,0,0,0,0,0,0,0,0,0,0,0,0,0,0,0,0,0,0,0,0,0,0]
[3,0,0,0,0,0,0,0,0,0,0,0,0,0,0,0,0,0,0,0,0,0,0,0,0,0,0,0,0,0,0,0,0,0,0,0,0,0,0,0,0,0,0,0,0,0,0,0,0,0,0,0,0,0,0,0,0,0,0,0,0,0,0,0,0,0,0,0,0,0,0,0,0,0,0,0,0,0,0,0,0,0,0,0,0,0,0,0,0,0,0,0,0,0,0,0,0,0,0,0,0,0,0,0,0,0,0,0,0,0,0,0,0,0,0,0,0,0,0,0,0,0,0,0,0,0,0,0,0,0,0,0,0,0,0,0,0,0,0,0,0,0,0,0,0,0,0,0,0,0,0,0,0,0,0,0,0,0,0,0,0,0,0,0,0,0,0,0,0,0,0,0,0,0,0,0,0,0,0,0,0,0,0,0,0,0,0,0,0,0,0,0,0,0,0,0,0,0,0,0,0,0,0,0,0,0,0,0,0,0,0,0,0,0,0,0,0,0,0,0,0,0,0,0,0,0,0,0,0,0,0,0,0,0,0,0,0,0,0,0,0,0,0,0,0,0,0,0,0,0,0]
[4,0,0,0,0,0,0,0,0,0,0,0,0,0,0,0,0,0,0,0,0,0,0,0,0,0,0,0,0,0,0,0,0,0,0,0,0,0,0,0,0,0,0,0,0,0,0,0,0,0,0,0,0,0,0,0,0,0,0,0,0,0,0,0,0,0,0,0,0,0,0,0,0,0,0,0,0,0,0,0,0,0,0,0,0,0,0,0,0,0,0,0,0,0,0,0,0,0,0,0,0,0,0,0,0,0,0,0,0,0,0,0,0,0,0,0,0,0,0,0,0,0,0,0,0,0,0,0,0,0,0,0,0,0,0,0,0,0,0,0,0,0,0,0,0,0,0,0,0,0,0,0,0,0,0,0,0,0,0,0,0,0,0,0,0,0,0,0,0,0,0,0,0,0,0,0,0,0,0,0,0,0,0,0,0,0,0,0,0,0,0,0,0,0,0,0,0,0,0,0,0,0,0,0,0,0,0,0,0,0,0,0,0,0,0,0,0,0,0,0,0,0,0,0,0,0,0,0,0,0,0,0,0,0,0,0,0,0,0,0,0,0,0,0,0,0,0,0,0,0,0]
[5,0,0,0,0,0,0,0,0,0,0,0,0,0,0,0,0,0,0,0,0,0,0,0,0,0,0,0,0,0,0,0,0,0,0,0,0,0,0,0,0,0,0,0,0,0,0,0,0,0,0,0,0,0,0,0,0,0,0,0,0,0,0,0,0,0,0,0,0,0,0,0,0,0,0,0,0,0,0,0,0,0,0,0,0,0,0,0,0,0,0,0,0,0,0,0,0,0,0,0,0,0,0,0,0,0,0,0,0,0,0,0,0,0,0,0,0,0,0,0,0,0,0,0,0,0,0,0,0,0,0,0,0,0,0,0,0,0,0,0,0,0,0,0,0,0,0,0,0,0,0,0,0,0,0,0,0,0,0,0,0,0,0,0,0,0,0,0,0,0,0,0,0,0,0,0,0,0,0,0,0,0,0,0,0,0,0,0,0,0,0,0,0,0,0,0,0,0,0,0,0,0,0,0,0,0,0,0,0,0,0,0,0,0,0,0,0,0,0,0,0,0,0,0,0,0,0,0,0,0,0,0,0,0,0,0,0,0,0,0,0,0,0,0,0,0,0,0,0,0,0]
[6,0,0,0,0,0,0,0,0,0,0,0,0,0,0,0,0,0,0,0,0,0,0,0,0,0,0,0,0,0,0,0,0,0,0,0,0,0,0,0,0,0,0,0,0,0,0,0,0,0,0,0,0,0,0,0,0,0,0,0,0,0,0,0,0,0,0,0,0,0,0,0,0,0,0,0,0,0,0,0,0,0,0,0,0,0,0,0,0,0,0,0,0,0,0,0,0,0,0,0,0,0,0,0,0,0,0,0,0,0,0,0,0,0,0,0,0,0,0,0,0,0,0,0,0,0,0,0,0,0,0,0,0,0,0,0,0,0,0,0,0,0,0,0,0,0,0,0,0,0,0,0,0,0,0,0,0,0,0,0,0,0,0,0,0,0,0,0,0,0,0,0,0,0,0,0,0,0,0,0,0,0,0,0,0,0,0,0,0,0,0,0,0,0,0,0,0,0,0,0,0,0,0,0,0,0,0,0,0,0,0,0,0,0,0,0,0,0,0,0,0,0,0,0,0,0,0,0,0,0,0,0,0,0,0,0,0,0,0,0,0,0,0,0,0,0,0,0,0,0,0]
[7,0,0,0,0,0,0,0,0,0,0,0,0,0,0,0,0,0,0,0,0,0,0,0,0,0,0,0,0,0,0,0,0,0,0,0,0,0,0,0,0,0,0,0,0,0,0,0,0,0,0,0,0,0,0,0,0,0,0,0,0,0,0,0,0,0,0,0,0,0,0,0,0,0,0,0,0,0,0,0,0,0,0,0,0,0,0,0,0,0,0,0,0,0,0,0,0,0,0,0,0,0,0,0,0,0,0,0,0,0,0,0,0,0,0,0,0,0,0,0,0,0,0,0,0,0,0,0,0,0,0,0,0,0,0,0,0,0,0,0,0,0,0,0,0,0,0,0,0,0,0,0,0,0,0,0,0,0,0,0,0,0,0,0,0,0,0,0,0,0,0,0,0,0,0,0,0,0,0,0,0,0,0,0,0,0,0,0,0,0,0,0,0,0,0,0,0,0,0,0,0,0,0,0,0,0,0,0,0,0,0,0,0,0,0,0,0,0,0,0,0,0,0,0,0,0,0,0,0,0,0,0,0,0,0,0,0,0,0,0,0,0,0,0,0,0,0,0,0,0,0]
[8,0,0,0,0,0,0,0,0,0,0,0,0,0,0,0,0,0,0,0,0,0,0,0,0,0,0,0,0,0,0,0,0,0,0,0,0,0,0,0,0,0,0,0,0,0,0,0,0,0,0,0,0,0,0,0,0,0,0,0,0,0,0,0,0,0,0,0,0,0,0,0,0,0,0,0,0,0,0,0,0,0,0,0,0,0,0,0,0,0,0,0,0,0,0,0,0,0,0,0,0,0,0,0,0,0,0,0,0,0,0,0,0,0,0,0,0,0,0,0,0,0,0,0,0,0,0,0,0,0,0,0,0,0,0,0,0,0,0,0,0,0,0,0,0,0,0,0,0,0,0,0,0,0,0,0,0,0,0,0,0,0,0,0,0,0,0,0,0,0,0,0,0,0,0,0,0,0,0,0,0,0,0,0,0,0,0,0,0,0,0,0,0,0,0,0,0,0,0,0,0,0,0,0,0,0,0,0,0,0,0,0,0,0,0,0,0,0,0,0,0,0,0,0,0,0,0,0,0,0,0,0,0,0,0,0,0,0,0,0,0,0,0,0,0,0,0,0,0,0,0]
[9,0,0,0,0,0,0,0,0,0,0,0,0,0,0,0,0,0,0,0,0,0,0,0,0,0,0,0,0,0,0,0,0,0,0,0,0,0,0,0,0,0,0,0,0,0,0,0,0,0,0,0,0,0,0,0,0,0,0,0,0,0,0,0,0,0,0,0,0,0,0,0,0,0,0,0,0,0,0,0,0,0,0,0,0,0,0,0,0,0,0,0,0,0,0,0,0,0,0,0,0,0,0,0,0,0,0,0,0,0,0,0,0,0,0,0,0,0,0,0,0,0,0,0,0,0,0,0,0,0,0,0,0,0,0,0,0,0,0,0,0,0,0,0,0,0,0,0,0,0,0,0,0,0,0,0,0,0,0,0,0,0,0,0,0,0,0,0,0,0,0,0,0,0,0,0,0,0,0,0,0,0,0,0,0,0,0,0,0,0,0,0,0,0,0,0,0,0,0,0,0,0,0,0,0,0,0,0,0,0,0,0,0,0,0,0,0,0,0,0,0,0,0,0,0,0,0,0,0,0,0,0,0,0,0,0,0,0,0,0,0,0,0,0,0,0,0,2,21,1,22]
[10,0,0,0,0,0,0,0,0,0,0,0,0,0,0,0,0,0,0,0,0,0,0,0,0,0,0,0,0,0,0,0,0,0,0,0,0,0,0,0,0,0,0,0,0,0,0,0,0,0,0,0,0,0,0,0,0,0,0,0,0,0,0,0,0,0,0,0,0,0,0,0,0,0,0,0,0,0,0,0,0,0,0,0,0,0,0,0,0,0,0,0,0,0,0,0,0,0,0,0,0,0,0,0,0,0,0,0,0,0,0,0,0,0,0,0,0,0,0,0,0,0,0,0,0,0,0,0,0,0,0,0,0,0,0,0,0,0,0,0,0,0,0,0,0,0,0,0,0,0,0,0,0,0,0,0,0,0,0,0,0,0,0,0,0,0,0,0,0,0,0,0,0,0,0,0,0,0,0,0,0,0,0,0,0,0,0,0,0,0,0,0,0,0,0,0,0,0,0,0,0,0,0,0,0,0,0,0,0,0,0,0,0,0,0,0,0,0,0,0,0,0,0,0,0,0,0,0,0,0,0,0,0,0,0,0,0,0,0,0,0,0,0,0,0,0,0,0,0,0,0]
[11,0,0,0,0,0,0,0,0,0,0,0,0,0,0,0,0,0,0,0,0,0,0,0,0,0,0,0,0,0,0,0,0,0,0,0,0,0,0,0,0,0,0,0,0,0,0,0,0,0,0,0,0,0,0,0,0,0,0,0,0,0,0,0,0,0,0,0,0,0,0,0,0,0,0,0,0,0,0,0,0,0,0,0,0,0,0,0,0,0,0,0,0,0,0,0,0,0,0,0,0,0,0,0,0,0,0,0,0,0,0,0,0,0,0,0,0,0,0,0,0,0,0,0,0,0,0,0,0,0,0,0,0,0,0,0,0,0,0,0,0,0,0,0,0,0,0,0,0,0,0,0,0,0,0,0,0,0,0,0,0,0,0,0,0,0,0,0,0,0,0,0,0,0,0,0,0,0,0,0,0,0,0,0,0,0,0,0,0,0,0,0,0,0,0,0,0,0,0,0,0,0,0,0,0,0,0,0,0,0,0,0,0,0,0,0,0,0,0,0,0,0,0,0,0,0,0,0,0,0,0,0,0,0,0,0,0,0,0,0,0,0,0,0,0,0,0,0,0,0,0]
[12,0,0,0,0,0,0,0,0,0,0,0,0,0,0,0,0,0,0,0,0,0,0,0,0,0,0,0,0,0,0,0,0,0,0,0,0,0,0,0,0,0,0,0,0,0,0,0,0,0,0,0,0,0,0,0,0,0,0,0,0,0,0,0,0,0,0,0,0,0,0,0,0,0,0,0,0,0,0,0,0,0,0,0,0,0,0,0,0,0,0,0,0,0,0,0,0,0,0,0,0,0,0,0,0,0,0,0,0,0,0,0,0,0,0,0,0,0,0,0,0,0,0,0,0,0,0,0,0,0,0,0,0,0,0,0,0,0,0,0,0,0,0,0,0,0,0,0,0,0,0,0,0,0,0,0,0,0,0,0,0,0,0,0,0,0,0,0,0,0,0,0,0,0,0,0,0,0,0,0,0,0,0,0,0,0,0,0,0,0,0,0,0,0,0,0,0,0,0,0,0,0,0,0,0,0,0,0,0,0,0,0,0,0,0,0,0,0,0,0,0,0,0,0,0,0,0,0,0,0,0,0,0,0,0,0,0,0,0,0,0,0,0,0,0,0,0,0,0,0,0]
["Total general",0,0,0,0,0,0,0,0,0,0,0,0,0,0,0,0,0,0,0,0,0,0,0,0,0,0,0,0,0,0,0,0,0,0,0,0,0,0,0,0,0,0,0,0,0,0,0,0,0,0,0,0,0,0,0,0,0,0,0,0,0,0,0,0,0,0,0,0,0,0,0,0,0,0,0,0,0,0,0,0,0,0,0,0,0,0,0,0,0,0,0,0,0,0,0,0,0,0,0,0,0,0,0,0,0,0,0,0,0,0,0,0,0,0,0,0,0,0,0,0,0,0,0,0,0,0,0,0,0,0,0,0,0,0,0,0,0,0,0,0,0,0,0,0,0,0,0,0,0,0,0,0,0,0,0,0,0,0,0,0,0,0,0,0,0,0,0,0,0,0,0,0,0,0,0,0,0,0,0,0,0,0,0,0,0,0,0,0,0,0,0,0,0,0,0,0,0,0,0,0,0,0,0,0,0,0,0,0,0,0,0,0,0,0,0,0,0,0,0,0,0,0,0,0,0,0,0,0,0,0,0,0,0,0,0,0,0,0,0,0,0,0,0,0,0,0,2,21,1,22]
[]
[]
[]
[]
[]
[]
[]
[]
[]
[]
[]
["Anio",2024]
["UE","(Todas)"]
["Red","(Todas)"]
["MicroRed","(Todas)"]
["EESS","(Todas)"]
["Provincia","(Todas)"]
["Distrito","(Todas)"]
[]
["Etiquetas de fila","Suma de metax501","Suma de metax502","Suma de metax503","Suma de metax504","Suma de metax505","Suma de metax506","Suma de metax507","Suma de metax508","Suma de metax509","Suma de metax510","Suma de metax511","Suma de metax512","Suma de metax513","Suma de metax514","Suma de metax515","Suma de metax516","Suma de metax517","Suma de metax518","Suma de metax519","Suma de metax520","Suma de metax521","Suma de metax522","Suma de metax523","Suma de metax524","Suma de metax525","Suma de metax526","Suma de metax527","Suma de metax528","Suma de metax529","Suma de metax530","Suma de metax532","Suma de metax533","Suma de metax531","Suma de metax534","Suma de metax535","Suma de metax536","Suma de metax537","Suma de metax538","Suma de metax539","Suma de metax540","Suma de metax542","Suma de metax541","Suma de metax544","Suma de metax543","Suma de metax545","Suma de metax546","Suma de metax547","Suma de metax548","Suma de metax549","Suma de metax550","Suma de metax552","Suma de metax553","Suma de metax554","Suma de metax551","Suma de metax555","Suma de metax556","Suma de metax557","Suma de metax558","Suma de metax559","Suma de metax560","Suma de metax561","Suma de metax562","Suma de metax563","Suma de metax564","Suma de metax565","Suma de metax566","Suma de metax567","Suma de metax568","Suma de metax569","Suma de metax570","Suma de metax571","Suma de metax572","Suma de metax573","Suma de metax574","Suma de metax575","Suma de metax576","Suma de metax577","Suma de metax578","Suma de metax579","Suma de metax580","Suma de metax581","Suma de metax582","Suma de metax583","Suma de metax584","Suma de metax585","Suma de metax586","Suma de metax587","Suma de metax588","Suma de metax589","Suma de metax590","Suma de metax591","Suma de metax592","Suma de metax593","Suma de metax594","Suma de metax595","Suma de metax596","Suma de metax597","Suma de metax600","Suma de metax599","Suma de metax598","Suma de metax601","Suma de metax602","Suma de metax603","Suma de metax604","Suma de metax605","Suma de metax606","Suma de metax607","Suma de metax608","Suma de metax609","Suma de metax610","Suma de metax611","Suma de metax612","Suma de metax613","Suma de metax614","Suma de metax615","Suma de metax616","Suma de metax617","Suma de metax618","Suma de metax619","Suma de metax620","Suma de metax621","Suma de metax622","Suma de metax623","Suma de metax624","Suma de metax625","Suma de metax626","Suma de metax627","Suma de metax628","Suma de metax629","Suma de metax630","Suma de metax631","Suma de metax632","Suma de metax633","Suma de metax634","Suma de metax635","Suma de metax636","Suma de metax637","Suma de metax638","Suma de metax639","Suma de metax640","Suma de metax641","Suma de metax642","Suma de metax643","Suma de metax644","Suma de metax645","Suma de metax646","Suma de metax647","Suma de metax648","Suma de metax649","Suma de metax650","Suma de metax651","Suma de metax652","Suma de metax653","Suma de metax654","Suma de metax655","Suma de metax656","Suma de metax657","Suma de metax658","Suma de metax659","Suma de metax660","Suma de metax661","Suma de metax662","Suma de metax663","Suma de metax665","Suma de metax666","Suma de metax664","Suma de metax667","Suma de metax668","Suma de metax669","Suma de metax670","Suma de metax671","Suma de metax673","Suma de metax672","Suma de metax674","Suma de metax675","Suma de metax676","Suma de metax677","Suma de metax678","Suma de metax679","Suma de metax680","Suma de metax681","Suma de metax682","Suma de metax683","Suma de metax685","Suma de metax684","Suma de metax687","Suma de metax688","Suma de metax686","Suma de metax689","Suma de metax690","Suma de metax691","Suma de metax692","Suma de metax693","Suma de metax694","Suma de metax695","Suma de metax696","Suma de metax697","Suma de metax698","Suma de metax699","Suma de metax700","Suma de metax701","Suma de metax702","Suma de metax703","Suma de metax704","Suma de metax705","Suma de metax706","Suma de metax707","Suma de metax708","Suma de metax709","Suma de metax710","Suma de metax711","Suma de metax712","Suma de metax713","Suma de metax714","Suma de metax715","Suma de metax716","Suma de metax717","Suma de metax718","Suma de metax719","Suma de metax720","Suma de metax721","Suma de metax722","Suma de metax723","Suma de metax724","Suma de metax725","Suma de metax726","Suma de metax727","Suma de metax728","Suma de metax729","Suma de metax730","Suma de metax731","Suma de metax732","Suma de metax733","Suma de metax734","Suma de metax735","Suma de metax736","Suma de metax737","Suma de metax738","Suma de metax739","Suma de metax740","Suma de metax741","Suma de metax742","Suma de metax743","Suma de metax745","Suma de metax746","Suma de metax747","Suma de metax748","Suma de metax744","Suma de metax749"]
[1,0,0,0,0,0,0,0,0,0,0,0,0,0,0,0,0,0,0,0,0,0,0,0,0,0,0,0,0,0,0,0,0,0,0,0,0,0,0,0,0,0,0,0,0,0,0,0,0,0,0,0,0,0,0,0,0,0,0,0,0,0,0,0,0,0,0,0,0,0,0,0,0,0,0,0,0,0,0,0,0,0,0,0,0,0,0,0,0,0,0,0,0,0,0,0,0,0,0,0,0,0,0,0,0,0,0,0,0,0,0,0,0,0,0,0,0,0,0,0,0,0,0,0,0,0,0,0,0,0,0,0,0,0,0,0,0,0,0,0,0,0,0,0,0,0,0,0,0,0,0,0,0,0,0,0,0,0,0,0,0,0,0,0,0,0,0,0,0,0,0,0,0,0,0,0,0,0,0,0,0,0,0,0,0,0,0,0,0,0,0,0,0,0,0,0,0,0,0,0,0,0,0,0,0,0,0,0,0,0,0,0,0,0,0,0,0,0,0,0,0,0,0,0,0,0,0,0,0,0,0,0,0,0,0,0,0,0,0,0,0,0,0,0,0,0,0,0,0,0]
[2,0,0,0,0,0,0,0,0,0,0,0,0,0,0,0,0,0,0,0,0,0,0,0,0,0,0,0,0,0,0,0,0,0,0,0,0,0,0,0,0,0,0,0,0,0,0,0,0,0,0,0,0,0,0,0,0,0,0,0,0,0,0,0,0,0,0,0,0,0,0,0,0,0,0,0,0,0,0,0,0,0,0,0,0,0,0,0,0,0,0,0,0,0,0,0,0,0,0,0,0,0,0,0,0,0,0,0,0,0,0,0,0,0,0,0,0,0,0,0,0,0,0,0,0,0,0,0,0,0,0,0,0,0,0,0,0,0,0,0,0,0,0,0,0,0,0,0,0,0,0,0,0,0,0,0,0,0,0,0,0,0,0,0,0,0,0,0,0,0,0,0,0,0,0,0,0,0,0,0,0,0,0,0,0,0,0,0,0,0,0,0,0,0,0,0,0,0,0,0,0,0,0,0,0,0,0,0,0,0,0,0,0,0,0,0,0,0,0,0,0,0,0,0,0,0,0,0,0,0,0,0,0,0,0,0,0,0,0,0,0,0,0,0,0,0,0,0,0,0]
[3,0,0,0,0,0,0,0,0,0,0,0,0,0,0,0,0,0,0,0,0,0,0,0,0,0,0,0,0,0,0,0,0,0,0,0,0,0,0,0,0,0,0,0,0,0,0,0,0,0,0,0,0,0,0,0,0,0,0,0,0,0,0,0,0,0,0,0,0,0,0,0,0,0,0,0,0,0,0,0,0,0,0,0,0,0,0,0,0,0,0,0,0,0,0,0,0,0,0,0,0,0,0,0,0,0,0,0,0,0,0,0,0,0,0,0,0,0,0,0,0,0,0,0,0,0,0,0,0,0,0,0,0,0,0,0,0,0,0,0,0,0,0,0,0,0,0,0,0,0,0,0,0,0,0,0,0,0,0,0,0,0,0,0,0,0,0,0,0,0,0,0,0,0,0,0,0,0,0,0,0,0,0,0,0,0,0,0,0,0,0,0,0,0,0,0,0,0,0,0,0,0,0,0,0,0,0,0,0,0,0,0,0,0,0,0,0,0,0,0,0,0,0,0,0,0,0,0,0,0,0,0,0,0,0,0,0,0,0,0,0,0,0,0,0,0,0,0,0,0]
[4,0,0,0,0,0,0,0,0,0,0,0,0,0,0,0,0,0,0,0,0,0,0,0,0,0,0,0,0,0,0,0,0,0,0,0,0,0,0,0,0,0,0,0,0,0,0,0,0,0,0,0,0,0,0,0,0,0,0,0,0,0,0,0,0,0,0,0,0,0,0,0,0,0,0,0,0,0,0,0,0,0,0,0,0,0,0,0,0,0,0,0,0,0,0,0,0,0,0,0,0,0,0,0,0,0,0,0,0,0,0,0,0,0,0,0,0,0,0,0,0,0,0,0,0,0,0,0,0,0,0,0,0,0,0,0,0,0,0,0,0,0,0,0,0,0,0,0,0,0,0,0,0,0,0,0,0,0,0,0,0,0,0,0,0,0,0,0,0,0,0,0,0,0,0,0,0,0,0,0,0,0,0,0,0,0,0,0,0,0,0,0,0,0,0,0,0,0,0,0,0,0,0,0,0,0,0,0,0,0,0,0,0,0,0,0,0,0,0,0,0,0,0,0,0,0,0,0,0,0,0,0,0,0,0,0,0,0,0,0,0,0,0,0,0,0,0,0,0,0]
[5,0,0,0,0,0,0,0,0,0,0,0,0,0,0,0,0,0,0,0,0,0,0,0,0,0,0,0,0,0,0,0,0,0,0,0,0,0,0,0,0,0,0,0,0,0,0,0,0,0,0,0,0,0,0,0,0,0,0,0,0,0,0,0,0,0,0,0,0,0,0,0,0,0,0,0,0,0,0,0,0,0,0,0,0,0,0,0,0,0,0,0,0,0,0,0,0,0,0,0,0,0,0,0,0,0,0,0,0,0,0,0,0,0,0,0,0,0,0,0,0,0,0,0,0,0,0,0,0,0,0,0,0,0,0,0,0,0,0,0,0,0,0,0,0,0,0,0,0,0,0,0,0,0,0,0,0,0,0,0,0,0,0,0,0,0,0,0,0,0,0,0,0,0,0,0,0,0,0,0,0,0,0,0,0,0,0,0,0,0,0,0,0,0,0,0,0,0,0,0,0,0,0,0,0,0,0,0,0,0,0,0,0,0,0,0,0,0,0,0,0,0,0,0,0,0,0,0,0,0,0,0,0,0,0,0,0,0,0,0,0,0,0,0,0,0,0,0,0,0]
[6,0,0,0,0,0,0,0,0,0,0,0,0,0,0,0,0,0,0,0,0,0,0,0,0,0,0,0,0,0,0,0,0,0,0,0,0,0,0,0,0,0,0,0,0,0,0,0,0,0,0,0,0,0,0,0,0,0,0,0,0,0,0,0,0,0,0,0,0,0,0,0,0,0,0,0,0,0,0,0,0,0,0,0,0,0,0,0,0,0,0,0,0,0,0,0,0,0,0,0,0,0,0,0,0,0,0,0,0,0,0,0,0,0,0,0,0,0,0,0,0,0,0,0,0,0,0,0,0,0,0,0,0,0,0,0,0,0,0,0,0,0,0,0,0,0,0,0,0,0,0,0,0,0,0,0,0,0,0,0,0,0,0,0,0,0,0,0,0,0,0,0,0,0,0,0,0,0,0,0,0,0,0,0,0,0,0,0,0,0,0,0,0,0,0,0,0,0,0,0,0,0,0,0,0,0,0,0,0,0,0,0,0,0,0,0,0,0,0,0,0,0,0,0,0,0,0,0,0,0,0,0,0,0,0,0,0,0,0,0,0,0,0,0,0,0,0,0,0,0]
[7,0,0,0,0,0,0,0,0,0,0,0,0,0,0,0,0,0,0,0,0,0,0,0,0,0,0,0,0,0,0,0,0,0,0,0,0,0,0,0,0,0,0,0,0,0,0,0,0,0,0,0,0,0,0,0,0,0,0,0,0,0,0,0,0,0,0,0,0,0,0,0,0,0,0,0,0,0,0,0,0,0,0,0,0,0,0,0,0,0,0,0,0,0,0,0,0,0,0,0,0,0,0,0,0,0,0,0,0,0,0,0,0,0,0,0,0,0,0,0,0,0,0,0,0,0,0,0,0,0,0,0,0,0,0,0,0,0,0,0,0,0,0,0,0,0,0,0,0,0,0,0,0,0,0,0,0,0,0,0,0,0,0,0,0,0,0,0,0,0,0,0,0,0,0,0,0,0,0,0,0,0,0,0,0,0,0,0,0,0,0,0,0,0,0,0,0,0,0,0,0,0,0,0,0,0,0,0,0,0,0,0,0,0,0,0,0,0,0,0,0,0,0,0,0,0,0,0,0,0,0,0,0,0,0,0,0,0,0,0,0,0,0,0,0,0,0,0,0,0]
[8,0,0,0,0,0,0,0,0,0,0,0,0,0,0,0,0,0,0,0,0,0,0,0,0,0,0,0,0,0,0,0,0,0,0,0,0,0,0,0,0,0,0,0,0,0,0,0,0,0,0,0,0,0,0,0,0,0,0,0,0,0,0,0,0,0,0,0,0,0,0,0,0,0,0,0,0,0,0,0,0,0,0,0,0,0,0,0,0,0,0,0,0,0,0,0,0,0,0,0,0,0,0,0,0,0,0,0,0,0,0,0,0,0,0,0,0,0,0,0,0,0,0,0,0,0,0,0,0,0,0,0,0,0,0,0,0,0,0,0,0,0,0,0,0,0,0,0,0,0,0,0,0,0,0,0,0,0,0,0,0,0,0,0,0,0,0,0,0,0,0,0,0,0,0,0,0,0,0,0,0,0,0,0,0,0,0,0,0,0,0,0,0,0,0,0,0,0,0,0,0,0,0,0,0,0,0,0,0,0,0,0,0,0,0,0,0,0,0,0,0,0,0,0,0,0,0,0,0,0,0,0,0,0,0,0,0,0,0,0,0,0,0,0,0,0,0,0,0,0]
[9,0,0,0,0,0,0,0,0,0,0,0,0,0,0,0,0,0,0,0,0,0,0,0,0,0,0,0,0,0,0,17,0,1,0,60,0,0,0,0,0,0,0,0,0,0,0,0,0,0,0,0,0,0,0,0,0,0,0,0,0,0,0,0,0,0,0,0,0,0,0,0,0,0,0,0,0,0,0,0,0,0,0,0,0,0,0,0,0,0,0,0,0,0,0,0,0,0,0,0,0,0,0,0,0,0,0,0,0,0,0,0,0,0,0,0,0,0,0,0,0,0,0,0,0,0,0,0,0,0,0,0,0,0,0,0,0,0,0,0,0,0,0,0,0,0,0,0,0,0,0,0,0,0,0,0,0,0,0,0,0,0,0,0,0,0,0,0,0,0,0,0,0,0,0,0,0,0,0,0,0,0,0,0,0,0,0,0,0,0,0,0,0,0,0,0,0,0,0,0,0,0,0,0,0,0,0,0,0,0,0,0,0,0,0,0,0,0,0,0,0,0,0,0,0,0,0,0,0,0,0,0,0,0,0,0,0,0,0,0,0,0,0,0,0,0,0,0,0,0]
[10,0,0,0,0,0,0,0,0,0,0,0,0,0,0,0,0,0,0,0,0,0,0,0,0,0,0,0,0,0,0,0,0,0,0,0,0,0,0,0,0,0,0,0,0,0,0,0,0,0,0,0,0,0,0,0,0,0,0,0,0,0,0,0,0,0,0,0,0,0,0,0,0,0,0,0,0,0,0,0,0,0,0,0,0,0,0,0,0,0,0,0,0,0,0,0,0,0,0,0,0,0,0,0,0,0,0,0,0,0,0,0,0,0,0,0,0,0,0,0,0,0,0,0,0,0,0,0,0,0,0,0,0,0,0,0,0,0,0,0,0,0,0,0,0,0,0,0,0,0,0,0,0,0,0,0,0,0,0,0,0,0,0,0,0,0,0,0,0,0,0,0,0,0,0,0,0,0,0,0,0,0,0,0,0,0,0,0,0,0,0,0,0,0,0,0,0,0,0,0,0,0,0,0,0,0,0,0,0,0,0,0,0,0,0,0,0,0,0,0,0,0,0,0,0,0,0,0,0,0,0,0,0,0,0,0,0,0,0,0,0,0,0,0,0,0,0,0,0,0]
[11,0,0,0,0,0,0,0,0,0,0,0,0,0,0,0,0,0,0,0,0,0,0,0,0,0,0,0,0,0,0,0,0,0,0,0,0,0,0,0,0,0,0,0,0,0,0,0,0,0,0,0,0,0,0,0,0,0,0,0,0,0,0,0,0,0,0,0,0,0,0,0,0,0,0,0,0,0,0,0,0,0,0,0,0,0,0,0,0,0,0,0,0,0,0,0,0,0,0,0,0,0,0,0,0,0,0,0,0,0,0,0,0,0,0,0,0,0,0,0,0,0,0,0,0,0,0,0,0,0,0,0,0,0,0,0,0,0,0,0,0,0,0,0,0,0,0,0,0,0,0,0,0,0,0,0,0,0,0,0,0,0,0,0,0,0,0,0,0,0,0,0,0,0,0,0,0,0,0,0,0,0,0,0,0,0,0,0,0,0,0,0,0,0,0,0,0,0,0,0,0,0,0,0,0,0,0,0,0,0,0,0,0,0,0,0,0,0,0,0,0,0,0,0,0,0,0,0,0,0,0,0,0,0,0,0,0,0,0,0,0,0,0,0,0,0,0,0,0,0]
[12,0,0,0,0,0,0,0,0,0,0,0,0,0,0,0,0,0,0,0,0,0,0,0,0,0,0,0,0,0,0,0,0,0,0,0,0,0,0,0,0,0,0,0,0,0,0,0,0,0,0,0,0,0,0,0,0,0,0,0,0,0,0,0,0,0,0,0,0,0,0,0,0,0,0,0,0,0,0,0,0,0,0,0,0,0,0,0,0,0,0,0,0,0,0,0,0,0,0,0,0,0,0,0,0,0,0,0,0,0,0,0,0,0,0,0,0,0,0,0,0,0,0,0,0,0,0,0,0,0,0,0,0,0,0,0,0,0,0,0,0,0,0,0,0,0,0,0,0,0,0,0,0,0,0,0,0,0,0,0,0,0,0,0,0,0,0,0,0,0,0,0,0,0,0,0,0,0,0,0,0,0,0,0,0,0,0,0,0,0,0,0,0,0,0,0,0,0,0,0,0,0,0,0,0,0,0,0,0,0,0,0,0,0,0,0,0,0,0,0,0,0,0,0,0,0,0,0,0,0,0,0,0,0,0,0,0,0,0,0,0,0,0,0,0,0,0,0,0,0]
["Total general",0,0,0,0,0,0,0,0,0,0,0,0,0,0,0,0,0,0,0,0,0,0,0,0,0,0,0,0,0,0,17,0,1,0,60,0,0,0,0,0,0,0,0,0,0,0,0,0,0,0,0,0,0,0,0,0,0,0,0,0,0,0,0,0,0,0,0,0,0,0,0,0,0,0,0,0,0,0,0,0,0,0,0,0,0,0,0,0,0,0,0,0,0,0,0,0,0,0,0,0,0,0,0,0,0,0,0,0,0,0,0,0,0,0,0,0,0,0,0,0,0,0,0,0,0,0,0,0,0,0,0,0,0,0,0,0,0,0,0,0,0,0,0,0,0,0,0,0,0,0,0,0,0,0,0,0,0,0,0,0,0,0,0,0,0,0,0,0,0,0,0,0,0,0,0,0,0,0,0,0,0,0,0,0,0,0,0,0,0,0,0,0,0,0,0,0,0,0,0,0,0,0,0,0,0,0,0,0,0,0,0,0,0,0,0,0,0,0,0,0,0,0,0,0,0,0,0,0,0,0,0,0,0,0,0,0,0,0,0,0,0,0,0,0,0,0,0,0,0]
[]
[]
[]
[]
[]
[]
[]
["Anio",2024]
["UE","(Todas)"]
["Red","(Todas)"]
["MicroRed","(Todas)"]
["EESS","(Todas)"]
["Provincia","(Todas)"]
["Distrito","(Todas)"]
[]
["Etiquetas de fila","Suma de otros01","Suma de otros02","Suma de otros03","Suma de otros04","Suma de otros05","Suma de otros06","Suma de otros07","Suma de otros08","Suma de otros09","Suma de otros10","Suma de otros11","Suma de otros12","Suma de otros13","Suma de otros14","Suma de otros15","Suma de otros16","Suma de otros17","Suma de otros18","Suma de otros19","Suma de otros20","Suma de otros21","Suma de otros22","Suma de otros23","Suma de otros24","Suma de otros25","Suma de otros26","Suma de otros27","Suma de otros28","Suma de otros29","Suma de otros30","Suma de otros31","Suma de otros32","Suma de otros33","Suma de otros34","Suma de otros35","Suma de otros36","Suma de otros37","Suma de otros38","Suma de otros39","Suma de otros40","Suma de otros41","Suma de otros42","Suma de otros43","Suma de otros44","Suma de otros45","Suma de otros46","Suma de otros47","Suma de otros48","Suma de otros49","Suma de otros50","Suma de otros51","Suma de otros52","Suma de otros54","Suma de otros53","Suma de otros55","Suma de otros56","Suma de otros57","Suma de otros58","Suma de otros60","Suma de otros59","Suma de otros61","Suma de otros62","Suma de otros63","Suma de otros64","Suma de otros65","Suma de otros66","Suma de otros67","Suma de otros68","Suma de otros69","Suma de otros70","Suma de otros71","Suma de otros72","Suma de otros73","Suma de otros74","Suma de otros75","Suma de otros76","Suma de otros77","Suma de otros78","Suma de otros79","Suma de otros80","Suma de otros81","Suma de otros82"]
[1,0,0,0,0,0,0,0,0,0,0,0,0,0,0,0,0,0,0,0,0,0,0,0,0,0,0,0,0,0,0,0,0,0,0,0,0,0,0,0,0,0,0,0,0,0,0,0,0,0,0,0,0,0,0,0,0,0,0,0,0,0,0,0,0,0,0,0,0,0,0,0,0,0,0,0,0,0,0,0,0,0,0]
[2,0,0,0,0,0,0,0,0,0,0,0,0,0,0,0,0,0,0,0,0,0,0,0,0,0,0,0,0,0,0,0,0,0,0,0,0,0,0,0,0,0,0,0,0,0,0,0,0,0,0,0,0,0,0,0,0,0,0,0,0,0,0,0,0,0,0,0,0,0,0,0,0,0,0,0,0,0,0,0,0,0,0]
[3,0,0,0,0,0,0,0,0,0,0,14,0,0,0,0,0,0,0,0,0,0,0,0,0,0,0,0,0,0,0,0,0,0,0,0,0,0,0,0,0,0,0,0,0,0,0,0,0,0,0,0,0,0,0,0,0,0,0,0,0,0,0,0,0,0,0,0,0,0,0,0,0,0,0,0,0,0,0,0,0,0,0]
[4,0,0,0,0,0,0,0,0,0,0,6,0,0,0,0,0,0,0,0,0,0,0,0,0,0,0,0,0,0,0,0,0,0,0,0,0,0,0,0,0,0,0,0,0,0,0,0,0,0,0,0,0,0,0,0,0,0,0,0,0,0,0,0,0,0,0,0,0,0,0,0,0,0,0,0,0,0,0,0,0,0,0]
[5,0,0,0,0,0,0,0,0,0,0,0,0,0,0,0,0,0,0,0,0,0,0,0,0,0,0,0,0,0,0,0,0,0,0,0,0,0,0,0,0,0,0,0,0,0,0,0,0,0,0,0,0,0,0,0,0,0,0,0,0,0,0,0,0,0,0,0,0,0,0,0,0,0,0,0,0,0,0,0,0,0,0]
[6,0,0,0,0,0,0,0,0,0,0,0,0,0,0,0,0,0,0,0,0,0,0,0,0,0,0,0,0,0,0,0,0,0,0,0,0,0,0,0,0,0,0,0,0,0,0,0,0,0,0,0,0,0,0,0,0,0,0,0,0,0,0,0,0,0,0,0,0,0,0,0,0,0,0,0,0,0,0,0,0,0,0]
[7,0,0,0,0,0,0,0,0,0,0,0,0,0,0,0,0,0,0,0,0,0,0,0,0,0,0,0,0,0,0,0,0,0,0,0,0,0,0,0,0,0,0,0,0,0,0,0,0,0,0,0,0,0,0,0,0,0,0,0,0,0,0,0,0,0,0,0,0,0,0,0,0,0,0,0,0,0,0,0,0,0,0]
[8,0,0,0,0,0,0,0,0,0,0,0,0,0,0,0,0,0,0,0,0,0,0,0,0,0,0,0,0,0,0,0,0,0,0,0,0,0,0,0,0,0,0,0,0,0,0,0,0,0,0,0,0,0,0,0,0,0,0,0,0,0,0,0,0,0,0,0,0,0,0,0,0,0,0,0,0,0,0,0,0,0,0]
[9,0,0,0,0,0,0,0,0,0,0,14,0,0,0,0,0,0,0,0,0,0,0,0,0,0,0,0,0,0,0,0,0,0,0,0,0,0,0,0,0,0,0,0,0,0,0,0,0,0,0,0,0,0,0,0,0,0,0,0,0,0,0,0,0,0,0,0,0,0,0,0,0,0,0,0,0,0,0,0,0,0,0]
[10,0,0,0,0,0,0,0,0,0,0,7,0,0,0,0,0,0,0,0,0,0,0,0,0,0,0,0,0,0,0,0,0,0,0,0,0,0,0,0,0,0,0,0,0,0,0,0,0,0,0,0,0,0,0,0,0,0,0,0,0,0,0,0,0,0,0,0,0,0,0,0,0,0,0,0,0,0,0,0,0,0,0]
[11,0,0,0,0,0,0,0,0,0,0,0,0,0,0,0,0,0,0,0,0,0,0,0,0,0,0,0,0,0,0,0,0,0,0,0,0,0,0,0,0,0,0,0,0,0,0,0,0,0,0,0,0,0,0,0,0,0,0,0,0,0,0,0,0,0,0,0,0,0,0,0,0,0,0,0,0,0,0,0,0,0,0]
[12,0,0,0,0,0,0,0,0,0,0,8,0,0,0,0,0,0,0,0,0,0,0,0,0,0,0,0,0,0,0,0,0,0,0,0,0,0,0,0,0,0,0,0,0,0,0,0,0,0,0,0,0,0,0,0,0,0,0,0,0,0,0,0,0,0,0,0,0,0,0,0,0,0,0,0,0,0,0,0,0,0,0]
["Total general",0,0,0,0,0,0,0,0,0,0,49,0,0,0,0,0,0,0,0,0,0,0,0,0,0,0,0,0,0,0,0,0,0,0,0,0,0,0,0,0,0,0,0,0,0,0,0,0,0,0,0,0,0,0,0,0,0,0,0,0,0,0,0,0,0,0,0,0,0,0,0,0,0,0,0,0,0,0,0,0,0,0]

{"sheet":"Menu","index":2,"n_rows":32,"n_cols":9,"rows_kept":32,"cut":false,"hidden":false,"merged":[[31,5,31,7],[1,4,1,16],[3,4,3,16],[2,4,2,16]]}
[]
["31/12/2024",null,null,null,"GERESA CUSCO"]
[null,null,null,null,"REPORTE HISMINSA 2024"]
[null,null,null,null,"PROMOCION DE LA SALUD"]
[]
[]
[]
[]
[]
[]
[]
[]
[]
[]
[]
[]
[]
[]
[]
[]
[]
[]
[]
[]
[]
[]
[]
[]
[]
[]
[]
[null,null,null,null,null,"Fecha Actulización DATA",null,null,{"$f":"A2","v":"31/12/2024"}]

{"sheet":"PP001","index":3,"n_rows":171,"n_cols":23,"rows_kept":171,"cut":false,"hidden":false,"merged":[[33,12,33,15],[40,2,41,5],[40,6,40,11],[40,12,40,15],[5,2,5,27],[11,3,11,6],[7,3,7,6],[7,10,7,15],[7,19,7,22],[8,22,8,23],[9,3,9,6],[9,10,9,15],[9,19,9,22],[11,10,11,15],[0,2,0,27],[1,2,1,27],[2,2,2,27],[3,2,3,27],[4,2,4,27],[94,6,94,7],[77,12,77,17],[78,2,78,5],[79,2,79,5],[65,2,65,5],[71,2,71,5],[72,2,72,5],[76,12,76,17],[83,6,83,11],[83,12,83,17],[84,2,84,5],[85,2,85,5],[52,6,52,7],[52,8,52,9],[53,6,53,7],[18,2,19,5],[18,6,19,6],[18,7,18,11],[25,2,26,5],[25,6,26,6],[25,7,25,9],[27,2,27,5],[28,2,28,5],[33,2,34,5],[33,6,33,11],[64,2,64,5],[53,8,53,9],[54,2,54,5],[62,6,62,7],[62,8,62,9],[63,6,63,7],[63,8,63,9],[55,2,55,5],[165,2,165,5],[167,2,167,5],[103,8,103,9],[124,2,124,5],[131,2,131,5],[132,2,132,5],[133,2,133,5],[134,2,134,5],[140,2,140,5],[141,2,141,5],[142,2,142,5],[166,2,166,5],[148,2,148,5],[153,2,153,5],[108,6,108,7],[108,8,108,9],[62,17,62,18],[62,19,62,20],[65,13,65,16],[64,13,64,16],[160,2,160,5],[154,2,154,5],[103,6,103,7],[69,6,69,8],[69,9,69,11],[70,6,70,8],[77,6,77,11],[70,9,70,11],[76,6,76,11],[82,6,82,11],[81,6,81,17],[71,13,71,16],[69,20,69,22],[70,17,70,19],[70,20,70,22],[82,12,82,17],[63,19,63,20],[72,13,72,16],[63,17,63,18],[69,17,69,19]]}
[null,null,"DIRECCION REGIONAL DE SALUD CUSCO"]
[null,null,"DIRECCION EJECUTIVA DE INTELIGENCIA SANITARIA"]
[null,null,"DIRECCION DE ESTADISTICA Y TELECOMUNICACIONES"]
[null,null,"PROMOCION DE LA SALUD"]
[null,null,"INFORME OPERACIONAL MENSUAL"]
[null,null,"ARTICULADO NUTRICIONAL"]
[]
[null,"RED DE SALUD",null,{"$f":"TD!F3","v":"(All)"},null,null,null,null,"PROVINCIA",null,{"$f":"TD!F6","v":"(All)"},null,null,null,null,null,null,"AÑO :",null,{"$f":"TD!C10","v":"2024"}]
[]
[null,"MICRO RED",null,{"$f":"TD!F4","v":"(All)"},null,null,null,null,"DISTRITO",null,{"$f":"TD!F7","v":"(All)"},null,null,null,null,null,null,"MES :",null,{"$f":"TD!O17","v":"ENERO - DICIEMBRE"}]
[]
[null,"ESTABLECIMIENTO",null,{"$f":"TD!F5","v":"(All)"},null,null,null,null,"U.E.",null,{"$f":"TD!F8","v":"(All)"}]
[]
[]
[null,null,"1. FAMILIAS CON NIÑOS(AS) MENORES DE 36 MESES Y GESTANTES RECIBEN SESIONES DEMOSTRATIVAS EN PREPARACION DE ALIMENTOS"]
[]
[null,null,"1.1. EN FAMILIAS CON NIÑAS Y NIÑOS MENORES DE 6 MESES A 11 MESES"]
[null,null,null,null,null,null,1,2,3,4,5,6]
[null,null,"TIPOS DE ACTIVIDAD/ EDADES",null,null,null,"Total de participantes","Familias participantes según edades de los niños y niñas"]
[null,"Act",null,null,null,null,null,"RN","1 - 5 meses","6 - 8 meses","9 - 11 meses","S/D"]
[null,1,"Lactancia Materna Exclusiva ó prolongada (LME)",null,null,null,{"$f":"L21+H21+I21","v":0},{"$f":"GETPIVOTDATA(\"Suma de Nino_01\",TD!$A$167)","v":0},{"$f":"GETPIVOTDATA(\"Suma de Nino_02\",TD!$A$167)","v":0},null,null,{"$f":"GETPIVOTDATA(\"Suma de Nino_03\",TD!$A$167)","v":0}]
[null,2,"Preparacion de alimentos (ALI)",null,null,null,{"$f":"L22+K22+J22","v":49},null,null,{"$f":"GETPIVOTDATA(\"Suma de Nino_04\",TD!$A$167)","v":35},{"$f":"GETPIVOTDATA(\"Suma de Nino_05\",TD!$A$167)","v":14},{"$f":"GETPIVOTDATA(\"Suma de Nino_06\",TD!$A$167)","v":0}]
[]
[null,null,"1.2. SESIONES DEMOSTRATIVAS A GESTANTES"]
[null,null,null,null,null,null,1,2,3,4]
[null,null,"TIPOS DE ACTIVIDAD/ EDADES",null,null,null,"Total de participantes","GESTANTE (NORMAL/RIESGO)"]
[null,null,null,null,null,null,null,"I Trim","II Trim","III Trim"]
[null,3,"Lactancia Materna Exclusiva (LME)",null,null,null,null,null,null,{"$f":"GETPIVOTDATA(\"Suma de Nino_08\",TD!$A$167)","v":0}]
[null,4,"Preparacion de alimentos (ALI)",null,null,null,{"$f":"SUM(H29:J29)","v":0},{"$f":"GETPIVOTDATA(\"Suma de Nino_09\",TD!$A$167)","v":0},{"$f":"GETPIVOTDATA(\"Suma de Nino_10\",TD!$A$167)","v":0},{"$f":"GETPIVOTDATA(\"Suma de Nino_11\",TD!$A$167)","v":0}]
[]
[]
[null,null,"1.3. CUANDO LA SESION DEMOSTRATIVA SE REALICE EN CENTROS DE PROMOCION Y VIGILANCIA COMUNAL"]
[null,null,null,null,null,null,1,2,3,4,5,6,7,8,9,10]
[null,null,"TIPOS DE ACTIVIDAD DE SD/ EDADES",null,null,null,null,null,null,null,null,null,"GESTANTE (NORMAL/RIESGO)",null,null,null,"Accion"]
[null,null,null,null,null,null,"Total de participantes","RN","1 - 5 meses","6 - 8 meses","9 - 11 meses","S/D","Total de participantes","I Trim","II Trim","III Trim","Grupo"]
[null,5,"Lactancia Materna Exclusiva (LME)",null,null,null,{"$f":"L36+H36+I36","v":0},{"$f":"GETPIVOTDATA(\"Suma de Nino_13\",TD!$A$167)","v":0},{"$f":"GETPIVOTDATA(\"Suma de Nino_14\",TD!$A$167)","v":0},null,null,{"$f":"GETPIVOTDATA(\"Suma de Nino_15\",TD!$A$167)","v":0},null,null,null,{"$f":"GETPIVOTDATA(\"Suma de Nino_19\",TD!$A$167)","v":0}]
[null,6,"Preparacion de alimentos (ALI)",null,null,null,{"$f":"L37+K37+J37","v":0},null,null,{"$f":"GETPIVOTDATA(\"Suma de Nino_16\",TD!$A$167)","v":0},{"$f":"GETPIVOTDATA(\"Suma de Nino_17\",TD!$A$167)","v":0},{"$f":"GETPIVOTDATA(\"Suma de Nino_18\",TD!$A$167)","v":0},{"$f":"SUM(N37:P37)","v":0},{"$f":"GETPIVOTDATA(\"Suma de Nino_20\",TD!$A$167)","v":0},{"$f":"GETPIVOTDATA(\"Suma de Nino_21\",TD!$A$167)","v":0},{"$f":"GETPIVOTDATA(\"Suma de Nino_22\",TD!$A$167)","v":0}]
[]
[null,null,"1.4. CUANDO LA SESION DEMOSTRATIVA SEA PROMOVIDA POR EL GOBIERNO LOCAL "]
[null,null,null,null,null,null,1,2,3,4,5,6,7,8,9,10]
[null,null,"TIPOS DE ACTIVIDAD DE SD/ EDADES",null,null,null,null,null,null,null,null,null,"GESTANTE (NORMAL/RIESGO)",null,null,null,"Accion"]
[null,null,null,null,null,null,"Total de participantes","RN","1 - 5 meses","6 - 8 meses","9 - 11 meses","S/D","Total de participantes","I Trim","II Trim","III Trim","Grupo"]
[null,7,"Lactancia Materna Exclusiva (LME)",null,null,null,{"$f":"H43+I43+J43+L43","v":19},{"$f":"GETPIVOTDATA(\"Suma de Nino_23\",TD!$A$167)","v":1},{"$f":"GETPIVOTDATA(\"Suma de Nino_24\",TD!$A$167)","v":18},null,null,{"$f":"GETPIVOTDATA(\"Suma de Nino_25\",TD!$A$167)","v":0},null,null,null,{"$f":"GETPIVOTDATA(\"Suma de Nino_29\",TD!$A$167)","v":0}]
[null,8,"Preparacion de alimentos (ALI)",null,null,null,{"$f":"J44+K44+L44","v":116},null,null,{"$f":"GETPIVOTDATA(\"Suma de Nino_26\",TD!$A$167)","v":65},{"$f":"GETPIVOTDATA(\"Suma de Nino_27\",TD!$A$167)","v":51},{"$f":"GETPIVOTDATA(\"Suma de Nino_28\",TD!$A$167)","v":0},{"$f":"SUM(N44:P44)","v":15},{"$f":"GETPIVOTDATA(\"Suma de Nino_30\",TD!$A$167)","v":1},{"$f":"GETPIVOTDATA(\"Suma de Nino_31\",TD!$A$167)","v":0},{"$f":"GETPIVOTDATA(\"Suma de Nino_32\",TD!$A$167)","v":14}]
[]
[]
[null,null,"trazador (niños)",{"$f":"G44+G37+G22","v":165}]
[null,null,"trazador (gestantes)",{"$f":"M44+M37+G29","v":15}]
[null,null,"TOTAL",{"$f":"SUM(D47:D48)","v":180}]
[null,null,"2.  FAMILIAS CON NIÑOS (AS) MENORES DE 24 MESES RECIBEN CONSEJERÍA A TRAVÉS DE VISITA DOMICILIARIA "]
[null,null,"Visita domiciliaria/ Teleorientación al Recién Nacido (dentro de los 7 días de nacido):"]
[null,null,null,null,null,null,1,2,3,4]
[null,null,null,null,null,null,"VISISTA DOMICILIARIA ",null,"TELESALUD"]
[null,null,null,null,null,null,"Recien nacido",null,"Recien nacido"]
[null,null,"TIPOS DE ACTIVIDAD DE VD/ EDADES",null,null,null,"Oportuno\n>=1 dia y      <=7 dias","Inoportuno\n>=8 dias","Oportuno\n>=1 dia y      <=7 dias","Inoportuno\n>=8 dias"]
[null,9,"Consejeria en lactancia Materna exclusiva",null,null,null,{"$f":"GETPIVOTDATA(\"Suma de Nino_33\",TD!$A$167)","v":66},{"$f":"GETPIVOTDATA(\"Suma de Nino_34\",TD!$A$167)","v":23},{"$f":"GETPIVOTDATA(\"Suma de Nino_35\",TD!$A$167)","v":0},{"$f":"GETPIVOTDATA(\"Suma de Nino_36\",TD!$A$167)","v":0}]
[null,10,"Consejería en Corte y cuidado del cordón umbilical",null,null,null,{"$f":"GETPIVOTDATA(\"Suma de Nino_37\",TD!$A$167)","v":55},{"$f":"GETPIVOTDATA(\"Suma de Nino_38\",TD!$A$167)","v":21},{"$f":"GETPIVOTDATA(\"Suma de Nino_39\",TD!$A$167)","v":0},{"$f":"GETPIVOTDATA(\"Suma de Nino_40\",TD!$A$167)","v":0}]
[null,11,"Consejería en Higiene del recién nacido y cuidado en el hogar",null,null,null,{"$f":"GETPIVOTDATA(\"Suma de Nino_41\",TD!$A$167)","v":4},{"$f":"GETPIVOTDATA(\"Suma de Nino_42\",TD!$A$167)","v":0},{"$f":"GETPIVOTDATA(\"Suma de Nino_43\",TD!$A$167)","v":0},{"$f":"GETPIVOTDATA(\"Suma de Nino_44\",TD!$A$167)","v":0}]
[null,12,"Consejería en Identificación de signos de alarma",null,null,null,{"$f":"GETPIVOTDATA(\"Suma de Nino_45\",TD!$A$167)","v":0},{"$f":"GETPIVOTDATA(\"Suma de Nino_46\",TD!$A$167)","v":0},{"$f":"GETPIVOTDATA(\"Suma de Nino_47\",TD!$A$167)","v":0},{"$f":"GETPIVOTDATA(\"Suma de Nino_48\",TD!$A$167)","v":0}]
[]
[null,null,"Visita domiciliaria/ Teleorientación  a Niñas (os) de 4 y 5 meses de edad"]
[null,null,null,null,null,null,1,2,3,4]
[null,null,null,null,null,null,"VISISTA DOMICILIARIA ",null,"TELESALUD",null,null,null,null,null,null,null,null,"VISITA DOMICILIARIA ",null,"TELESALUD"]
[null,null,null,null,null,null,"Entre 4 a 5 meses",null,"Entre 4 a 5 meses",null,null,null,null,null,null,null,null,"Entre 4 a 5 meses",null,"Entre 4 a 5 meses"]
[null,null,"TIPOS DE ACTIVIDAD DE VD/ EDADES",null,null,null,"4 meses","5 meses","4 meses","5 meses",null,null,null,"TIPOS DE ACTIVIDAD DE VD/ EDADES",null,null,null,"4 meses","5 meses","4 meses","5 meses"]
[null,13,"Consejeria en suplementación con hierro ",null,null,null,{"$f":"GETPIVOTDATA(\"Suma de Nino_49\",TD!$A$167)","v":69},{"$f":"GETPIVOTDATA(\"Suma de Nino_50\",TD!$A$167)","v":24},{"$f":"GETPIVOTDATA(\"Suma de Nino_51\",TD!$A$167)","v":0},{"$f":"GETPIVOTDATA(\"Suma de Nino_52\",TD!$A$167)","v":0},null,null,null,"Consejeria integral",null,null,null,{"$f":"GETPIVOTDATA(\"Suma de Nino_138\",TD!$A$167)","v":34},{"$f":"GETPIVOTDATA(\"Suma de Nino_139\",TD!$A$167)","v":10},{"$f":"GETPIVOTDATA(\"Suma de Nino_140\",TD!$A$167)","v":0},{"$f":"GETPIVOTDATA(\"Suma de Nino_141\",TD!$A$167)","v":0}]
[]
[null,null,"Visita domiciliaria/ Teleorientación  a Niñas (os) de 6 a 11 meses de edad SIN Dx. Anemia"]
[null,null,null,null,null,null,1,2,3,4,5,6]
[null,null,null,null,null,null,"VISISTA DOMICILIARIA ",null,null,"TELESALUD",null,null,null,null,null,null,null,"VISISTA DOMICILIARIA ",null,null,"TELESALUD"]
[null,null,null,null,null,null,"Entre 6 a 11 meses SIN ANEMIA",null,null,"Entre 6 a 11 meses SIN ANEMIA",null,null,null,null,null,null,null,"Entre 6 a 11 meses SIN ANEMIA",null,null,"Entre 6 a 11 meses SIN ANEMIA"]
[null,null,"TIPOS DE ACTIVIDAD DE VD/ EDADES",null,null,null,"6 meses","9 meses","11 meses","6 meses","9 meses","11 meses",null,"TIPOS DE ACTIVIDAD DE VD/ EDADES",null,null,null,"6 meses","9 meses","11 meses","6 meses","9 meses","11 meses"]
[null,15,"Consejeria en suplementación con hierro ",null,null,null,{"$f":"GETPIVOTDATA(\"Suma de Nino_53\",TD!$A$167)","v":26},{"$f":"GETPIVOTDATA(\"Suma de Nino_54\",TD!$A$167)","v":7},{"$f":"GETPIVOTDATA(\"Suma de Nino_55\",TD!$A$167)","v":9},{"$f":"GETPIVOTDATA(\"Suma de Nino_56\",TD!$A$167)","v":0},{"$f":"GETPIVOTDATA(\"Suma de Nino_57\",TD!$A$167)","v":0},{"$f":"GETPIVOTDATA(\"Suma de Nino_58\",TD!$A$167)","v":0},null,"Consejeria integral",null,null,null,{"$f":"GETPIVOTDATA(\"Suma de Nino_142\",TD!$A$167)","v":21},{"$f":"GETPIVOTDATA(\"Suma de Nino_143\",TD!$A$167)","v":4},{"$f":"GETPIVOTDATA(\"Suma de Nino_144\",TD!$A$167)","v":7},{"$f":"GETPIVOTDATA(\"Suma de Nino_145\",TD!$A$167)","v":0},{"$f":"GETPIVOTDATA(\"Suma de Nino_146\",TD!$A$167)","v":0},{"$f":"GETPIVOTDATA(\"Suma de Nino_147\",TD!$A$167)","v":0}]
[]
[null,null,"Visita domiciliaria/ Teleorientación  a Niñas (os) de 6 a 11 meses de edad CON Dx. Anemia"]
[null,null,null,null,null,null,1,2,3,4,5,6,7,8,9,10,11,12]
[null,null,null,null,null,null,"VISISTA DOMICILIARIA ",null,null,null,null,null,"TELESALUD"]
[null,null,null,null,null,null,"Entre 6 a 11 meses CON ANEMIA",null,null,null,null,null,"Entre 6 a 11 meses CON ANEMIA"]
[null,null,"TIPOS DE ACTIVIDAD DE VD/ EDADES",null,null,null,"6 meses","7 meses","8 meses","9 meses","10 meses","11 meses","6 meses","7 meses","8 meses","9 meses","10 meses","11 meses"]
[null,16,"Consejeria en tratamiento de la anemia ",null,null,null,{"$f":"GETPIVOTDATA(\"Suma de Nino_59\",TD!$A$167)","v":1},{"$f":"GETPIVOTDATA(\"Suma de Nino_60\",TD!$A$167)","v":1},{"$f":"GETPIVOTDATA(\"Suma de Nino_61\",TD!$A$167)","v":0},{"$f":"GETPIVOTDATA(\"Suma de Nino_62\",TD!$A$167)","v":1},{"$f":"GETPIVOTDATA(\"Suma de Nino_63\",TD!$A$167)","v":0},{"$f":"GETPIVOTDATA(\"Suma de Nino_64\",TD!$A$167)","v":2},{"$f":"GETPIVOTDATA(\"Suma de Nino_65\",TD!$A$167)","v":0},{"$f":"GETPIVOTDATA(\"Suma de Nino_66\",TD!$A$167)","v":0},{"$f":"GETPIVOTDATA(\"Suma de Nino_67\",TD!$A$167)","v":0},{"$f":"GETPIVOTDATA(\"Suma de Nino_68\",TD!$A$167)","v":0},{"$f":"GETPIVOTDATA(\"Suma de Nino_69\",TD!$A$167)","v":0},{"$f":"GETPIVOTDATA(\"Suma de Nino_70\",TD!$A$167)","v":0}]
[]
[]
[null,null,null,null,null,null,"VISISTA DOMICILIARIA ",null,null,null,null,null,"TELESALUD"]
[null,null,null,null,null,null,"Entre 6 a 11 meses CON ANEMIA",null,null,null,null,null,"Entre 6 a 11 meses CON ANEMIA"]
[null,null,"TIPOS DE ACTIVIDAD DE VD/ EDADES",null,null,null,"6 meses","7 meses","8 meses","9 meses","10 meses","11 meses","6 meses","7 meses","8 meses","9 meses","10 meses","11 meses"]
[null,null,"Consejeria Integral",null,null,null,{"$f":"GETPIVOTDATA(\"Suma de Nino_148\",TD!$A$167)","v":1},{"$f":"GETPIVOTDATA(\"Suma de Nino_149\",TD!$A$167)","v":1},{"$f":"GETPIVOTDATA(\"Suma de Nino_150\",TD!$A$167)","v":0},{"$f":"GETPIVOTDATA(\"Suma de Nino_151\",TD!$A$167)","v":2},{"$f":"GETPIVOTDATA(\"Suma de Nino_152\",TD!$A$167)","v":0},{"$f":"GETPIVOTDATA(\"Suma de Nino_153\",TD!$A$167)","v":2},{"$f":"GETPIVOTDATA(\"Suma de Nino_154\",TD!$A$167)","v":0},{"$f":"GETPIVOTDATA(\"Suma de Nino_155\",TD!$A$167)","v":0},{"$f":"GETPIVOTDATA(\"Suma de Nino_156\",TD!$A$167)","v":0},{"$f":"GETPIVOTDATA(\"Suma de Nino_157\",TD!$A$167)","v":0},{"$f":"GETPIVOTDATA(\"Suma de Nino_158\",TD!$A$167)","v":0},{"$f":"GETPIVOTDATA(\"Suma de Nino_159\",TD!$A$167)","v":0}]
[]
[null,null,"3.  FAMILIAS CON NIÑOS (AS) MENORES DE 36 MESES Y GESTANTES QUE\nPARTICIPAN EN GRUPOS DE APOYO COMUNAL PARA PROMOVER CUIDADO\nINFANTIL, LME Y LA ADECUADA ALIMENTACIÓN Y PROTECCIÓN DEL MENOR DE\n36 MESES"]
[]
[null,null,null,null,null,null,1,2]
[null,null,null,null,null,null,"Nº","Participantes"]
[null,"Reunion","Reunión de Coordinación -implementación",null,null,null,{"$f":"GETPIVOTDATA(\"Suma de Nino_71\",TD!$A$167)","v":0},{"$f":"GETPIVOTDATA(\"Suma de Nino_72\",TD!$A$167)","v":0}]
[null,null,"Reunión de Coordinación - Reactivación",null,null,null,{"$f":"GETPIVOTDATA(\"Suma de Nino_73\",TD!$A$167)","v":0},{"$f":"GETPIVOTDATA(\"Suma de Nino_74\",TD!$A$167)","v":0}]
[null,null,null,null,null,null,1,2,null,3,4]
[null,null,"Taller de capacitación ",null,null,null,"LME",null,null,"ALI"]
[null,null,null,null,null,null,"N°  DE ASISTENCIA TÉCNICA","N° PARTICIPANTES",null,"N°  DE ASISTENCIA TÉCNICA","N° PARTICIPANTES"]
[null,"Sesion",null,null,null,"Sesión 1: Habilidades comunicacionales y conducción de grupos de apoyo",{"$f":"GETPIVOTDATA(\"Suma de Nino_75\",TD!$A$167)","v":0},{"$f":"GETPIVOTDATA(\"Suma de Nino_76\",TD!$A$167)","v":0},"Sesión 5: Alimentación complementaria",{"$f":"GETPIVOTDATA(\"Suma de Nino_83\",TD!$A$167)","v":0},{"$f":"GETPIVOTDATA(\"Suma de Nino_84\",TD!$A$167)","v":0}]
[null,null,null,null,null,"Sesión 2: Lactancia materna y embarazo",{"$f":"GETPIVOTDATA(\"Suma de Nino_77\",TD!$A$167)","v":0},{"$f":"GETPIVOTDATA(\"Suma de Nino_78\",TD!$A$167)","v":0},"Sesión 6: Anemia y suplementación con hierro",{"$f":"GETPIVOTDATA(\"Suma de Nino_85\",TD!$A$167)","v":0},{"$f":"GETPIVOTDATA(\"Suma de Nino_86\",TD!$A$167)","v":0}]
[null,null,null,null,null,"Sesión 3: Lactancia materna y el niño o niña menor de seis mes",{"$f":"GETPIVOTDATA(\"Suma de Nino_79\",TD!$A$167)","v":0},{"$f":"GETPIVOTDATA(\"Suma de Nino_80\",TD!$A$167)","v":0},"Sesión 7: Desnutrición crónica, cuidado infantil, entre otros temas de prioridad",{"$f":"GETPIVOTDATA(\"Suma de Nino_87\",TD!$A$167)","v":0},{"$f":"GETPIVOTDATA(\"Suma de Nino_88\",TD!$A$167)","v":0}]
[null,null,null,null,null,"Sesión 4: Lactancia materna y el niño o niña de seis (6) a veinticuatro (24) meses.",{"$f":"GETPIVOTDATA(\"Suma de Nino_81\",TD!$A$167)","v":0},{"$f":"GETPIVOTDATA(\"Suma de Nino_82\",TD!$A$167)","v":0}]
[]
[]
[null,null,null,null,null,null,1,2,3,4]
[null,null,"Asistencia Técnica",null,null,null,"LME",null,"ALI"]
[null,null,null,null,null,null,"N°  DE ASISTENCIA TÉCNICA","N° PARTICIPANTES","N°  DE ASISTENCIA TÉCNICA","N° PARTICIPANTES"]
[null,"Asistencia",null,null,null,null,{"$f":"GETPIVOTDATA(\"Suma de Nino_90\",TD!$A$167)","v":9},{"$f":"GETPIVOTDATA(\"Suma de Nino_91\",TD!$A$167)","v":26},{"$f":"GETPIVOTDATA(\"Suma de Nino_92\",TD!$A$167)","v":8},{"$f":"GETPIVOTDATA(\"Suma de Nino_93\",TD!$A$167)","v":16}]
[]
[null,null,null,null,null,null,1,2,3,4]
[null,null,"Funcionamiento de los grupos de apoyo",null,null,null,"LME",null,"ALI"]
[null,null,null,null,null,"N° de sesiones","N° DE SESIÓN","N° DE PARTICIPANTES","N° DE SESIÓN","N°  PARTICIPANTES"]
[null,null,null,null,null,"1ra sesion",{"$f":"GETPIVOTDATA(\"Suma de Nino_160\",TD!$A$167)","v":7},{"$f":"GETPIVOTDATA(\"Suma de Nino_161\",TD!$A$167)","v":86},{"$f":"GETPIVOTDATA(\"Suma de Nino_162\",TD!$A$167)","v":0},{"$f":"GETPIVOTDATA(\"Suma de Nino_163\",TD!$A$167)","v":0}]
[null,null,null,null,null,"2da sesion",{"$f":"GETPIVOTDATA(\"Suma de Nino_164\",TD!$A$167)","v":7},{"$f":"GETPIVOTDATA(\"Suma de Nino_165\",TD!$A$167)","v":86},{"$f":"GETPIVOTDATA(\"Suma de Nino_166\",TD!$A$167)","v":0},{"$f":"GETPIVOTDATA(\"Suma de Nino_167\",TD!$A$167)","v":0}]
[null,null,null,null,null,"3ra sesion",{"$f":"GETPIVOTDATA(\"Suma de Nino_168\",TD!$A$167)","v":7},{"$f":"GETPIVOTDATA(\"Suma de Nino_169\",TD!$A$167)","v":86},{"$f":"GETPIVOTDATA(\"Suma de Nino_170\",TD!$A$167)","v":0},{"$f":"GETPIVOTDATA(\"Suma de Nino_171\",TD!$A$167)","v":0}]
[null,null,null,null,null,"4ta sesion",{"$f":"GETPIVOTDATA(\"Suma de Nino_172\",TD!$A$167)","v":7},{"$f":"GETPIVOTDATA(\"Suma de Nino_173\",TD!$A$167)","v":86},{"$f":"GETPIVOTDATA(\"Suma de Nino_174\",TD!$A$167)","v":0},{"$f":"GETPIVOTDATA(\"Suma de Nino_175\",TD!$A$167)","v":0}]
[]
[null,null,null,"TRAZADOR",{"$f":"H112+J111","v":86}]
[null,null,null,null,null,null,1,2]
[null,null,"Monitoreo",null,null,null,"N° DE SESIÓN","N° DE PARTICIPANTES"]
[null,"Reunion",null,null,null,"1er Monitoreo",{"$f":"GETPIVOTDATA(\"Suma de Nino_98\",TD!$A$167)","v":0},{"$f":"GETPIVOTDATA(\"Suma de Nino_99\",TD!$A$167)","v":0}]
[null,null,null,null,null,"2do Monitoreo",{"$f":"GETPIVOTDATA(\"Suma de Nino_100\",TD!$A$167)","v":0},{"$f":"GETPIVOTDATA(\"Suma de Nino_101\",TD!$A$167)","v":0}]
[]
[]
[null,null,"4.  COMITES MULTISECTORIALES CAPACITADOS PARA LA\nPROMOCIÓN DEL CUIDADO INFANTIL, LACTANCIA MATERNA EXCLUSIVA Y LA\nADECUADA ALIMENTACIÓN Y PROTECCIÓN DEL MENOR DE 36 MESES EN SU\nDISTRITO. "]
[null,null,null,null,null,null,1,2]
[null,"Reunion","Reuniones",null,null,null,"Reuniones","Participantes"]
[null,null,"Reunión de coordinación con la Municipalidad",null,null,null,{"$f":"GETPIVOTDATA(\"Suma de Nino_102\",TD!$A$167)","v":2},{"$f":"GETPIVOTDATA(\"Suma de Nino_103\",TD!$A$167)","v":35}]
[null,null,"Reunión tecnica con la Municipalidad para conformación del Comité Multisectorial",null,null,null,{"$f":"GETPIVOTDATA(\"Suma de Nino_104\",TD!$A$167)","v":1},{"$f":"GETPIVOTDATA(\"Suma de Nino_105\",TD!$A$167)","v":15}]
[null,null,"Reunión de socialización de la informacion para el analisis de anemia y DCI.",null,null,null,{"$f":"GETPIVOTDATA(\"Suma de Nino_106\",TD!$A$167)","v":0},{"$f":"GETPIVOTDATA(\"Suma de Nino_107\",TD!$A$167)","v":0}]
[null,null,"    Taller de planificación para la elaboración del plan de trabajo multisectorial para\ncontribuir en la reducción de la Anemia y DCI en el distrito.",null,null,null,{"$f":"GETPIVOTDATA(\"Suma de Nino_108\",TD!$A$167)","v":0},{"$f":"GETPIVOTDATA(\"Suma de Nino_109\",TD!$A$167)","v":0}]
[null,null,null,null,null,null,1,2]
[null,"Asistencia","Asistencia Técnica",null,null,null,"Asistencia tecnica","Participantes"]
[null,null,"Sala Situacional Municipal = 1",null,null,null,{"$f":"GETPIVOTDATA(\"Suma de Nino_110\",TD!$A$167)","v":0},{"$f":"GETPIVOTDATA(\"Suma de Nino_111\",TD!$A$167)","v":0}]
[null,null,"Implementación de políticas públicas (Ordenanzas municipales) = 2",null,null,null,{"$f":"GETPIVOTDATA(\"Suma de Nino_112\",TD!$A$167)","v":0},{"$f":"GETPIVOTDATA(\"Suma de Nino_113\",TD!$A$167)","v":0}]
[null,null,"Implementación de planes o proyectos de intervención = 3",null,null,null,{"$f":"GETPIVOTDATA(\"Suma de Nino_114\",TD!$A$167)","v":0},{"$f":"GETPIVOTDATA(\"Suma de Nino_115\",TD!$A$167)","v":0}]
[null,null,"Programación multianual y formulación anual del presupuesto en PAN = 4",null,null,null,{"$f":"GETPIVOTDATA(\"Suma de Nino_116\",TD!$A$167)","v":0},{"$f":"GETPIVOTDATA(\"Suma de Nino_117\",TD!$A$167)","v":0}]
[]
[]
[]
[null,null,null,null,null,null,1,2]
[null,"Reunion","Monitoreo y evaluación",null,null,null,"Asistencia tecnica","Participantes"]
[null,null,"Reunion de monitoreo = 1",null,null,null,{"$f":"GETPIVOTDATA(\"Suma de Nino_118\",TD!$A$167)","v":0}]
[null,null,"Reunion de monitoreo = 2",null,null,null,{"$f":"GETPIVOTDATA(\"Suma de Nino_119\",TD!$A$167)","v":0}]
[null,null,"Reunion de evaluación = 1",null,null,null,{"$f":"GETPIVOTDATA(\"Suma de Nino_120\",TD!$A$167)","v":0},{"$f":"GETPIVOTDATA(\"Suma de Nino_121\",TD!$A$167)","v":0}]
[]
[null,null,null,"TRAZADOR",{"$f":"G143","v":0}]
[]
[null,null,"5. ACTORES SOCIALES CAPACITADOS PARA LA\nPROMOCIÓN DEL CUIDADO INFANTIL, LACTANCIA MATERNA EXCLUSIVA Y LA\nADECUADA ALIMENTACIÓN Y PROTECCIÓN DEL MENOR DE 36 MESES DEL\nDISTRITO."]
[null,null,null,null,null,null,1,2]
[null,null,"Reuniones",null,null,null,"Reuniones","Participantes"]
[null,null,"Reunión de coordinación con la comunidad",null,null,null,{"$f":"GETPIVOTDATA(\"Suma de Nino_122\",TD!$A$167)","v":0},{"$f":"GETPIVOTDATA(\"Suma de Nino_123\",TD!$A$167)","v":0}]
[]
[null,null,null,null,null,null,1,2]
[null,"Taller","Taller de capacitación",null,null,null,"Taller de Capacitación","Participantes"]
[null,null,"Sesiones educativas en vigilancia Comunitaria",null,null,null,{"$f":"GETPIVOTDATA(\"Suma de Nino_124\",TD!$A$167)","v":2},{"$f":"GETPIVOTDATA(\"Suma de Nino_125\",TD!$A$167)","v":73}]
[null,null,"Sesiones demostrativas de preparación de alimentos",null,null,null,{"$f":"GETPIVOTDATA(\"Suma de Nino_126\",TD!$A$167)","v":0},{"$f":"GETPIVOTDATA(\"Suma de Nino_127\",TD!$A$167)","v":0}]
[]
[null,null,"TRAZADOR",{"$f":"GETPIVOTDATA(\"Suma de Nino_125\",TD!$A$167)","v":73}]
[]
[null,null,"6. PROMOTORES EDUCATIVOS CAPACITADOS PARA LA PROMOCIÓN DEL CUIDADO INFANTIL, LACTANCIA MATERNA EXCLUSIVA Y LA ADECUADA ALIMENTACIÓN Y PROTECCION DEL MENOR DE 36 MESES A FAMILIAS DEL PRONOEI. (3325108)"]
[null,null,null,null,null,null,1,2]
[null,null,"Reuniones",null,null,null,"Reuniones","Participantes"]
[null,"Reunion","Reunión de coordinación con la Red Educativa/Coordinación Educativa (COE) de la UGEL",null,null,null,{"$f":"GETPIVOTDATA(\"Suma de Nino_128\",TD!$A$167)","v":0},{"$f":"GETPIVOTDATA(\"Suma de Nino_129\",TD!$A$167)","v":0}]
[null,null,"Reunión de concertación con Red Educativa/COE (UGEL), para socializar la situación de anemia y DCI y establecer la capacitación",null,null,null,{"$f":"GETPIVOTDATA(\"Suma de Nino_130\",TD!$A$167)","v":0},{"$f":"GETPIVOTDATA(\"Suma de Nino_131\",TD!$A$167)","v":0}]
[null,null,null,null,null,null,1,2]
[null,null,"Sesiones educativas",null,null,null,"Asistencia tecnica","Participantes"]
[null,"Taller","Importancia de los servicios básicos de salud.",null,null,null,{"$f":"GETPIVOTDATA(\"Suma de Nino_132\",TD!$A$167)","v":0},{"$f":"GETPIVOTDATA(\"Suma de Nino_133\",TD!$A$167)","v":0}]
[null,null,"Alimentación complementaria con énfasis en el consumo de AOA.",null,null,null,{"$f":"GETPIVOTDATA(\"Suma de Nino_134\",TD!$A$167)","v":0},{"$f":"GETPIVOTDATA(\"Suma de Nino_135\",TD!$A$167)","v":0}]
[null,null,"Alimentación responsiva",null,null,null,{"$f":"GETPIVOTDATA(\"Suma de Nino_136\",TD!$A$167)","v":0},{"$f":"GETPIVOTDATA(\"Suma de Nino_137\",TD!$A$167)","v":0}]
[]
[]
[null,null,"TRAZADOR",{"$f":"GETPIVOTDATA(\"Suma de Nino_135\",TD!$A$167)","v":0}]

{"sheet":"PP002","index":4,"n_rows":151,"n_cols":21,"rows_kept":151,"cut":false,"hidden":false,"merged":[[14,0,153,0],[14,1,78,1],[18,4,18,5],[18,7,18,8],[29,4,29,5],[29,7,29,8],[79,1,109,1],[83,3,83,4],[89,3,89,4],[95,4,95,5],[95,6,95,7],[111,4,111,5],[143,1,153,1],[145,4,145,5],[8,22,8,23],[11,3,11,6],[5,2,5,27],[7,3,7,6],[7,10,7,15],[7,18,7,19],[7,20,7,22],[11,10,11,15],[9,3,9,6],[9,10,9,15],[9,18,9,19],[9,20,9,22],[0,2,0,27],[1,2,1,27],[2,2,2,27],[3,2,3,27],[4,2,4,27]]}
[null,null,"DIRECCION REGIONAL DE SALUD CUSCO"]
[null,null,"DIRECCION EJECUTIVA DE INTELIGENCIA SANITARIA"]
[null,null,"DIRECCION DE ESTADISTICA Y TELECOMUNICACIONES"]
[null,null,"PROMOCION DE LA SALUD"]
[null,null,"INFORME OPERACIONAL MENSUAL"]
[null,null,"SALUD MATERNO NEONATAL"]
[]
[null,null,"RED DE SALUD",{"$f":"TD!F3","v":"(All)"},null,null,null,null,"PROVINCIA",null,{"$f":"TD!F6","v":"(All)"},null,null,null,null,null,null,null,"AÑO :",null,{"$f":"TD!C10","v":"2024"}]
[]
[null,null,"MICRO RED",{"$f":"TD!F4","v":"(All)"},null,null,null,null,"DISTRITO",null,{"$f":"TD!F7","v":"(All)"},null,null,null,null,null,null,null,"MES :",null,{"$f":"TD!O17","v":"ENERO - DICIEMBRE"}]
[]
[null,null,"ESTABLECIMIENTO",{"$f":"TD!F5","v":"(All)"},null,null,null,null,"U.E.",null,{"$f":"TD!F8","v":"(All)"}]
[]
[]
["PP 002 SALUD MATERNO NEONATAL",null,null,"1. FAMILIAS DE LA GESTANTE Y PUÉRPERA QUE RECIBEN\nCONSEJERÍA EN EL HOGAR ATRAVÉS DE LA VISITA DOMICILIARIA PARA\nPROMOVER PRÁCTICAS SALUDABLES EN SALUD SEXUAL Y REPRODUCTIVA\nDURANTE LA VISITA DOMICILIAR"]
[]
[null,null,null,"Consejería durante el periodo gestacional."]
[null,null,null,null,2,3,null,5,6]
[null,null,null,null,"VISITA DOMICILIARIA",null,null,"TELESALUD"]
[null,null,null,1,"1° Consejería","2° Consejería",4,"1° Consejería","2° Consejería"]
[null,null,null,"I Trimestre","II Trimestre","III Trimestre","I Trimestre","II Trimestre","III Trimestre"]
[null,null,1,{"$f":"GETPIVOTDATA(\"Suma de Mater_01\",TD!$A$59)","v":0},{"$f":"GETPIVOTDATA(\"Suma de Mater_02\",TD!$A$59)","v":23},{"$f":"GETPIVOTDATA(\"Suma de Mater_03\",TD!$A$59)","v":51},{"$f":"GETPIVOTDATA(\"Suma de Mater_04\",TD!$A$59)","v":0},{"$f":"GETPIVOTDATA(\"Suma de Mater_05\",TD!$A$59)","v":0},{"$f":"GETPIVOTDATA(\"Suma de Mater_06\",TD!$A$59)","v":0}]
[]
[null,null,null,"TRAZADOR",{"$f":"GETPIVOTDATA(\"Suma de Mater_07\",TD!$A$59)","v":51}]
[]
[]
[null,null,null,"Consejería durante el periodo post natal"]
[]
[null,null,null,null,2,3,null,5,6]
[null,null,null,null,"VISITA DOMICILIARIA",null,null,"TELESALUD"]
[null,null,null,1,"1° Consejería","2° Consejería",4,"1° Consejería","2° Consejería"]
[null,null,null," otro momento diferente ","7 días de producido el parto","Entre los 28 y 30 días de producido el parto"," otro momento diferente ","7 días de producido el parto","Entre los 28 y 30 días de producido el parto"]
[null,null,2,{"$f":"GETPIVOTDATA(\"Suma de Mater_08\",TD!$A$59)","v":0},{"$f":"GETPIVOTDATA(\"Suma de Mater_09\",TD!$A$59)","v":0},{"$f":"GETPIVOTDATA(\"Suma de Mater_10\",TD!$A$59)","v":7},{"$f":"GETPIVOTDATA(\"Suma de Mater_11\",TD!$A$59)","v":0},{"$f":"GETPIVOTDATA(\"Suma de Mater_12\",TD!$A$59)","v":0},{"$f":"GETPIVOTDATA(\"Suma de Mater_13\",TD!$A$59)","v":0}]
[]
[null,null,null,"2. AGENTES COMUNITARIOS DE SALUD CAPACITADOS\nREALIZAN ORIENTACIÓN A FAMILIAS DE GESTANTES Y PUÉRPERAS EN\nPRÁCTICAS SALUDABLES EN SALUD SEXUAL Y REPRODUCTIVA "]
[]
[null,null,null,"1° orientación: entre la 28 y 40 semana (tercer trimestre) de gestación "]
[null,null,null,null,1]
[null,null,null,null,"Orientación"]
[null,null,3,"1º Orientación",{"$f":"GETPIVOTDATA(\"Suma de Mater_14\",TD!$A$59)","v":0}]
[null,null,null,"2º Orientación",{"$f":"GETPIVOTDATA(\"Suma de Mater_15\",TD!$A$59)","v":0}]
[]
[null,null,null,"2° orientación: en los 7 primeros días de producido el parto."]
[]
[null,null,null,null,1]
[null,null,null,null,"Orientación"]
[null,null,4,"1º Orientación",{"$f":"GETPIVOTDATA(\"Suma de Mater_16\",TD!$A$59)","v":0}]
[null,null,null,"2º Orientación",{"$f":"GETPIVOTDATA(\"Suma de Mater_17\",TD!$A$59)","v":0}]
[]
[null,null,null,"TRAZADOR",{"$f":"E40+E47","v":0}]
[]
[null,null,null,"Capacitación a agentes comunitarios de Salud en Salud Sexual y Reproductiva."]
[null,null,null,null,1,2]
[null,null,null,"Tematica","N°","Participantes"]
[null,null,5,"Para indicar Vigilancia Comunitaria",{"$f":"GETPIVOTDATA(\"Suma de Mater_18\",TD!$A$59)","v":0},{"$f":"GETPIVOTDATA(\"Suma de Mater_19\",TD!$A$59)","v":0}]
[null,null,6,"Para prácticas saludables",{"$f":"GETPIVOTDATA(\"Suma de Mater_20\",TD!$A$59)","v":1},{"$f":"GETPIVOTDATA(\"Suma de Mater_21\",TD!$A$59)","v":21}]
[null,null,7,"Referencia Comunal",{"$f":"GETPIVOTDATA(\"Suma de Mater_22\",TD!$A$59)","v":3},{"$f":"GETPIVOTDATA(\"Suma de Mater_23\",TD!$A$59)","v":61}]
[]
[null,null,null,"Referencia comunitaria realizadas por Agente Comunitario de Salud:"]
[null,null,null,1,2]
[null,null,null,"Nº","Participantes"]
[null,null,8,{"$f":"GETPIVOTDATA(\"Suma de Mater_24\",TD!$A$59)","v":1},{"$f":"GETPIVOTDATA(\"Suma de Mater_25\",TD!$A$59)","v":21}]
[]
[null,null,null,"3. FAMILIAS DE ADOLESCENTES QUE RECIBEN SESIONES EDUCATIVAS Y DEMOSTRATIVA PARA PROMOVER PRÁCTICAS SALUDABLES EN SALUD SEXUAL INTEGRAL"]
[]
[null,null,null,"Sesiones educativas y demostrativas a familias de adolescentes"]
[null,null,null,null,1,2]
[null,null,null,"Tematica","Nº","Participantes"]
[null,null,9,"1er eje temático: Sexualidad.",{"$f":"GETPIVOTDATA(\"Suma de Mater_26\",TD!$A$59)","v":2},{"$f":"GETPIVOTDATA(\"Suma de Mater_27\",TD!$A$59)","v":58}]
[null,null,10,"2do eje temático: Identidad.",{"$f":"GETPIVOTDATA(\"Suma de Mater_28\",TD!$A$59)","v":0},{"$f":"GETPIVOTDATA(\"Suma de Mater_29\",TD!$A$59)","v":0}]
[null,null,11,"3er eje temático: Cambios en la Pubertad y Adolescencia.",{"$f":"GETPIVOTDATA(\"Suma de Mater_30\",TD!$A$59)","v":1},{"$f":"GETPIVOTDATA(\"Suma de Mater_31\",TD!$A$59)","v":44}]
[null,null,12,"4to eje temático: Igualdad de género.",{"$f":"GETPIVOTDATA(\"Suma de Mater_32\",TD!$A$59)","v":0},{"$f":"GETPIVOTDATA(\"Suma de Mater_33\",TD!$A$59)","v":0}]
[null,null,13,"5to eje temático: Relaciones afectivas y libres de violencia.",{"$f":"GETPIVOTDATA(\"Suma de Mater_34\",TD!$A$59)","v":1},{"$f":"GETPIVOTDATA(\"Suma de Mater_35\",TD!$A$59)","v":34}]
[null,null,14,"6to eje temático: Previniendo el abuso sexual y maltrato.",{"$f":"GETPIVOTDATA(\"Suma de Mater_36\",TD!$A$59)","v":0},{"$f":"GETPIVOTDATA(\"Suma de Mater_37\",TD!$A$59)","v":0}]
[null,null,15,"7to eje temático: Planificando el futuro.",{"$f":"GETPIVOTDATA(\"Suma de Mater_38\",TD!$A$59)","v":2},{"$f":"GETPIVOTDATA(\"Suma de Mater_39\",TD!$A$59)","v":58}]
[]
[null,null,null,"TRAZADOR",{"$f":"GETPIVOTDATA(\"Suma de Mater_39\",TD!$A$59)","v":58}]
[]
[]
[null,null,null,"4. DOCENTES CAPACITADOS REALIZAN EDUCACIÓN SEXUAL INTEGRAL DESDE LA INSTITUCIÓN EDUCATIVA"]
[]
[null,null,null,"Incidencia ante la Unidad de Gestión Educativa Local–UGEL"]
[null,null,null,1,2]
[null,null,null,"UGL "]
[null,null,null,"Nº","Participantes"]
[null,null,16,{"$f":"GETPIVOTDATA(\"Suma de Mater_40\",TD!$A$59)","v":0},{"$f":"GETPIVOTDATA(\"Suma de Mater_41\",TD!$A$59)","v":0}]
[]
[null,null,null,"Incidencia con directivos y docentes de instituciones educativas"]
[null,null,null,1,2]
[null,null,null,"IE"]
[null,null,null,"Nº","Participantes"]
[null,null,17,{"$f":"GETPIVOTDATA(\"Suma de Mater_42\",TD!$A$59)","v":5},{"$f":"GETPIVOTDATA(\"Suma de Mater_43\",TD!$A$59)","v":168}]
[]
[null,null,null,"Capacitación a docentes y directivos de instituciones educativas "]
[null,null,null,null,1,2,3,4]
[null,null,null,null,"Docentes de IE del nivel Primaria",null,"Docentes de IE del nivel Secundario"]
[null,null,null,"Tematica","Nº","Participantes","Nº","Participantes"]
[null,null,18,"1er eje temático: Sexualidad.",{"$f":"GETPIVOTDATA(\"Suma de Mater_44\",TD!$A$59)","v":1},{"$f":"GETPIVOTDATA(\"Suma de Mater_45\",TD!$A$59)","v":4},{"$f":"GETPIVOTDATA(\"Suma de Mater_58\",TD!$A$59)","v":4},{"$f":"GETPIVOTDATA(\"Suma de Mater_59\",TD!$A$59)","v":143}]
[null,null,19,"2do eje temático: Identidad.",{"$f":"GETPIVOTDATA(\"Suma de Mater_46\",TD!$A$59)","v":0},{"$f":"GETPIVOTDATA(\"Suma de Mater_47\",TD!$A$59)","v":0},{"$f":"GETPIVOTDATA(\"Suma de Mater_60\",TD!$A$59)","v":0},{"$f":"GETPIVOTDATA(\"Suma de Mater_61\",TD!$A$59)","v":0}]
[null,null,20,"3er eje temático: Cambios en la Pubertad y Adolescencia.",{"$f":"GETPIVOTDATA(\"Suma de Mater_48\",TD!$A$59)","v":0},{"$f":"GETPIVOTDATA(\"Suma de Mater_49\",TD!$A$59)","v":0},{"$f":"GETPIVOTDATA(\"Suma de Mater_62\",TD!$A$59)","v":1},{"$f":"GETPIVOTDATA(\"Suma de Mater_63\",TD!$A$59)","v":36}]
[null,null,21,"4to eje temático: Igualdad de género.",{"$f":"GETPIVOTDATA(\"Suma de Mater_50\",TD!$A$59)","v":0},{"$f":"GETPIVOTDATA(\"Suma de Mater_51\",TD!$A$59)","v":0},{"$f":"GETPIVOTDATA(\"Suma de Mater_64\",TD!$A$59)","v":3},{"$f":"GETPIVOTDATA(\"Suma de Mater_65\",TD!$A$59)","v":115}]
[null,null,22,"5to eje temático: Relaciones afectivas y libres de violencia.",{"$f":"GETPIVOTDATA(\"Suma de Mater_52\",TD!$A$59)","v":0},{"$f":"GETPIVOTDATA(\"Suma de Mater_53\",TD!$A$59)","v":0},{"$f":"GETPIVOTDATA(\"Suma de Mater_66\",TD!$A$59)","v":4},{"$f":"GETPIVOTDATA(\"Suma de Mater_67\",TD!$A$59)","v":145}]
[null,null,23,"6to eje temático: Previniendo el abuso sexual y maltrato.",{"$f":"GETPIVOTDATA(\"Suma de Mater_54\",TD!$A$59)","v":0},{"$f":"GETPIVOTDATA(\"Suma de Mater_55\",TD!$A$59)","v":0},{"$f":"GETPIVOTDATA(\"Suma de Mater_68\",TD!$A$59)","v":0},{"$f":"GETPIVOTDATA(\"Suma de Mater_69\",TD!$A$59)","v":0}]
[null,null,24,"7to eje temático: Planificando el futuro.",{"$f":"GETPIVOTDATA(\"Suma de Mater_56\",TD!$A$59)","v":0},{"$f":"GETPIVOTDATA(\"Suma de Mater_57\",TD!$A$59)","v":0},{"$f":"GETPIVOTDATA(\"Suma de Mater_70\",TD!$A$59)","v":1},{"$f":"GETPIVOTDATA(\"Suma de Mater_71\",TD!$A$59)","v":36}]
[]
[null,null,null,"TRAZADOR (PRIMARIA)",{"$f":"F103","v":0}]
[null,null,null,"TRAZADOR (SECUNDARIA)",{"$f":"H104","v":36}]
[null,null,null,"TOTAL",{"$f":"SUM(E106:E107)","v":36}]
[]
[null,null,null,"Docentes capacitados que realizan sesiones de aprendizaje de salud sexual a los adolescentes"]
[null,null,null,null,1,2]
[null,null,null,null,"Docentes de IE del nivel Primaria"]
[null,null,null,"Tematica","Nº","Participantes"]
[null,null,25,"1er eje temático: Sexualidad.",{"$f":"GETPIVOTDATA(\"Suma de Mater_72\",TD!$A$59)","v":3},{"$f":"GETPIVOTDATA(\"Suma de Mater_73\",TD!$A$59)","v":135}]
[null,null,26,"2do eje temático: Identidad.",{"$f":"GETPIVOTDATA(\"Suma de Mater_74\",TD!$A$59)","v":0},{"$f":"GETPIVOTDATA(\"Suma de Mater_75\",TD!$A$59)","v":0}]
[null,null,27,"3er eje temático: Cambios en la Pubertad y Adolescencia.",{"$f":"GETPIVOTDATA(\"Suma de Mater_76\",TD!$A$59)","v":1},{"$f":"GETPIVOTDATA(\"Suma de Mater_77\",TD!$A$59)","v":42}]
[null,null,28,"4to eje temático: Igualdad de género.",{"$f":"GETPIVOTDATA(\"Suma de Mater_78\",TD!$A$59)","v":0},{"$f":"GETPIVOTDATA(\"Suma de Mater_79\",TD!$A$59)","v":0}]
[null,null,29,"5to eje temático: Relaciones afectivas y libres de violencia.",{"$f":"GETPIVOTDATA(\"Suma de Mater_80\",TD!$A$59)","v":1},{"$f":"GETPIVOTDATA(\"Suma de Mater_81\",TD!$A$59)","v":50}]
[null,null,30,"6to eje temático: Previniendo el abuso sexual y maltrato.",{"$f":"GETPIVOTDATA(\"Suma de Mater_82\",TD!$A$59)","v":0},{"$f":"GETPIVOTDATA(\"Suma de Mater_83\",TD!$A$59)","v":0}]
[null,null,31,"7to eje temático: Planificando el futuro.",{"$f":"GETPIVOTDATA(\"Suma de Mater_84\",TD!$A$59)","v":1},{"$f":"GETPIVOTDATA(\"Suma de Mater_85\",TD!$A$59)","v":50}]
[]
[null,null,null,"5. FUNCIONARIOS MUNICIPALES CAPACITADOS GESTIONAN ESPACIOS EDUCATIVOS PARA PROMOVER LA SALUD SEXUAL Y REPRODUCTIVA"]
[]
[null,null,null,"Acciones de incidencia y asesoramiento"]
[null,null,null,null,1]
[null,null,null,"Tematica","Nº"]
[null,null,32,"Implementación y funcionamiento de la Casa Materna",{"$f":"GETPIVOTDATA(\"Suma de Mater_86\",TD!$A$59)","v":0}]
[null,null,33,"Implementación y funcionamiento de Centros de Desarrollo Juvenil.",{"$f":"GETPIVOTDATA(\"Suma de Mater_87\",TD!$A$59)","v":0}]
[null,null,null,"Si la reunión tiene como agenda la implementación de Programas educativos comunicacionales en salud sexual y reproductiva",{"$f":"GETPIVOTDATA(\"Suma de Mater_87_1\",TD!$A$59)","v":0}]
[]
[null,null,null,"Capacitación a Funcionarios Municipales/Comité de Gestión Local/Comité Multisectorial de Salud."]
[null,null,null,null,1,2]
[null,null,null,"Tematica","Nº","Nº DE PARTICIPANTES"]
[null,null,34,"Implementación y funcionamiento de la Casa Materna",{"$f":"GETPIVOTDATA(\"Suma de Mater_88\",TD!$A$59)","v":0},{"$f":"GETPIVOTDATA(\"Suma de Mater_89\",TD!$A$59)","v":0}]
[null,null,35,"Implementación y funcionamiento de Centros de Desarrollo Juvenil.",{"$f":"GETPIVOTDATA(\"Suma de Mater_90\",TD!$A$59)","v":0},{"$f":"GETPIVOTDATA(\"Suma de Mater_91\",TD!$A$59)","v":0}]
[null,null,null,"Si la reunión tiene como agenda la implementación de Programas educativos comunicacionales en salud sexual y reproductiva",{"$f":"GETPIVOTDATA(\"Suma de Mater_91_1\",TD!$A$59)","v":0},{"$f":"GETPIVOTDATA(\"Suma de Mater_91_2\",TD!$A$59)","v":0}]
[]
[null,null,null,"Reunión de Monitoreo con Funcionarios Municipales/Comité de Gestión Local/Comité Multisectorial de Salud para la implementación de espacios educativos para promover la salud sexual y reproductiva  "]
[null,null,null,null,1]
[null,null,null,"Tematica","Nº"]
[null,null,36,"Implementación y funcionamiento de la Casa Materna",{"$f":"GETPIVOTDATA(\"Suma de Mater_92\",TD!$A$59)","v":0}]
[null,null,37,"Implementación y funcionamiento de Centros de Desarrollo Juvenil.",{"$f":"GETPIVOTDATA(\"Suma de Mater_93\",TD!$A$59)","v":0}]
[]
[null,null,null,"Reunión de Evaluación con Funcionarios Municipales/Comité de Gestión Local/Comité Multisectorial de Salud para el funcionamiento de espacios educativos que promuevan la salud sexual y reproductiva  "]
[null,null,null,null,1,2,3]
[null,null,null,null,"SE ENCUENTRA FUNCIONANDO",null,"NO SE ENCUENTRA FUNCIONANDO"]
[null,null,null,"Tematica","Reuniones","Participantes","Reuniones"]
[null,null,38,"Implementación y funcionamiento de la Casa Materna",{"$f":"GETPIVOTDATA(\"Suma de Mater_94\",TD!$A$59)","v":0},{"$f":"GETPIVOTDATA(\"Suma de Mater_95\",TD!$A$59)","v":0},{"$f":"GETPIVOTDATA(\"Suma de Mater_96\",TD!$A$59)","v":0}]
[null,null,39,"Implementación y funcionamiento de Centros de Desarrollo Juvenil.",{"$f":"GETPIVOTDATA(\"Suma de Mater_97\",TD!$A$59)","v":0},{"$f":"GETPIVOTDATA(\"Suma de Mater_98\",TD!$A$59)","v":0},{"$f":"GETPIVOTDATA(\"Suma de Mater_99\",TD!$A$59)","v":0}]
[]
[null,null,null,"TRAZADOR ",{"$f":"E148+E149","v":0}]

{"sheet":"PP016","index":5,"n_rows":170,"n_cols":26,"rows_kept":170,"cut":false,"hidden":false,"merged":[[58,4,58,7],[58,8,58,11],[59,4,59,5],[59,6,59,7],[59,8,59,9],[59,10,59,11],[9,5,9,8],[9,23,9,24],[9,25,9,27],[0,1,0,32],[1,1,1,32],[2,1,2,32],[3,1,3,32],[4,1,4,32],[5,1,5,32],[7,5,7,8],[7,23,7,24],[7,25,7,27],[8,27,8,28],[7,13,7,17],[9,13,9,17],[11,13,11,17],[15,0,169,0],[15,1,45,1],[17,3,17,4],[17,5,17,6],[47,1,169,1],[49,4,49,7],[82,4,82,5],[82,6,82,7],[11,5,11,8],[25,3,25,4],[25,5,25,6],[33,4,33,5],[33,6,33,7],[43,3,43,4],[43,5,43,6],[49,8,49,11],[50,4,50,5],[50,6,50,7],[50,8,50,9],[50,10,50,11],[65,3,65,6],[65,7,65,10],[66,3,66,4],[66,5,66,6],[66,7,66,8],[66,9,66,10],[73,3,73,6],[73,7,73,10],[74,3,74,4],[74,5,74,6],[74,7,74,8],[74,9,74,10],[94,3,94,6],[94,7,94,10],[95,3,95,4],[95,5,95,6],[95,7,95,8],[95,9,95,10],[102,3,102,6],[102,7,102,10],[103,3,103,4],[103,5,103,6],[103,7,103,8],[103,9,103,10],[112,4,112,5],[112,6,112,7],[121,4,121,5],[121,6,121,7],[128,4,128,5],[128,6,128,7],[165,3,165,4],[165,5,165,6],[165,7,165,8],[165,9,165,10],[145,4,145,5],[145,6,145,7],[156,4,156,5],[156,6,156,7],[164,3,164,6],[164,7,164,10]]}
[null,"DIRECCION REGIONAL DE SALUD CUSCO"]
[null,"DIRECCION EJECUTIVA DE INTELIGENCIA SANITARIA"]
[null,"DIRECCION DE ESTADISTICA Y TELECOMUNICACIONES"]
[null,"PROMOCION DE LA SALUD"]
[null,"INFORME OPERACIONAL MENSUAL"]
[null,"TBC Y VIH"]
[]
[null,null,"RED DE SALUD",null,null,{"$f":"TD!F3","v":"(All)"},null,null,null,null,null,"PROVINCIA",null,{"$f":"TD!F6","v":"(All)"},null,null,null,null,null,null,null,null,null,"AÑO :",null,{"$f":"TD!C10","v":"2024"}]
[]
[null,null,"MICRO RED",null,null,{"$f":"TD!F4","v":"(All)"},null,null,null,null,null,"DISTRITO",null,{"$f":"TD!F7","v":"(All)"},null,null,null,null,null,null,null,null,null,"MES :",null,{"$f":"TD!O17","v":"ENERO - DICIEMBRE"}]
[]
[null,null,"ESTABLECIMIENTO",null,null,{"$f":"TD!F5","v":"(All)"},null,null,null,null,null,"U.E.",null,{"$f":"TD!F8","v":"(All)"}]
[]
[]
[null,null,"1. FAMILIAS QUE RECIBEN CONSEJERÍA A TRAVÉS DE VISITA\nDOMICILIARIA PARA PROMOVER PRÁCTICAS Y ENTORNOS SALUDABLES PARA\nCONTRIBUIR A LA DISMINUCION DE LA TUBERCULOSIS Y VIH/SIDA"]
[" \nPROGRAMA PRESUPUESTAL 016 TBC / VIH SIDA ","ACTIVIDAD FAMILIAS","Consejería integral a través de visitas domiciliarias en prácticas saludables y medidas preventivas (TBC)"]
[null,null,null,1,2,3,4]
[null,null,null,"VISITA DOMICILIARIA",null,"TELESALUD"]
[null,null,null,"1° Consejería","2° Consejería","1° Consejería","2° Consejería"]
[null,null,1,{"$f":"GETPIVOTDATA(\"Suma de tbc_01\",TD!$A$115)","v":46},{"$f":"GETPIVOTDATA(\"Suma de tbc_02\",TD!$A$115)","v":49},{"$f":"GETPIVOTDATA(\"Suma de tbc_03\",TD!$A$115)","v":0},{"$f":"GETPIVOTDATA(\"Suma de tbc_04\",TD!$A$115)","v":0}]
[]
[null,null,null,"trazador",{"$f":"E20+G20","v":49}]
[null,null,"Consejería para  el auto cuidado del cuerpo y medidas preventivas (VIH/SIDA)"]
[]
[null,null,null,1,2,3,4]
[null,null,null,"VISITA DOMICILIARIA",null,"TELESALUD"]
[null,null,null,"1° Consejería","2° Consejería","1° Consejería","2° Consejería"]
[null,null,2,{"$f":"GETPIVOTDATA(\"Suma de tbc_06\",TD!$A$115)","v":23},{"$f":"GETPIVOTDATA(\"Suma de tbc_07\",TD!$A$115)","v":23},{"$f":"GETPIVOTDATA(\"Suma de tbc_08\",TD!$A$115)","v":0},{"$f":"GETPIVOTDATA(\"Suma de tbc_09\",TD!$A$115)","v":0}]
[]
[]
[null,null,"2. FAMILIAS QUE RECIBEN SESIÓN EDUCATIVA Y\nDEMOSTRATIVA PARA PROMOVER PRÁCTICAS Y ENTORNOS SALUDABLES PARA\nCONTRIBUIR A LA DISMINUCION DE LA TUBERCULOSIS Y VIH/SIDA"]
[null,null,"Sesiones Educativas y demostrativas"]
[null,null,null,null,1,2,3,4]
[null,null,null,null,"TBC",null,"VIH/SIDA"]
[null,null,null,"Sesiones educativas y demostrativas","Nº","Participantes","Nº","Participantes"]
[null,null,3,"1º sesión educativa y demostrativa",{"$f":"GETPIVOTDATA(\"Suma de tbc_10\",TD!$A$115)","v":2},{"$f":"GETPIVOTDATA(\"Suma de tbc_11\",TD!$A$115)","v":31},{"$f":"GETPIVOTDATA(\"Suma de tbc_12\",TD!$A$115)","v":1},{"$f":"GETPIVOTDATA(\"Suma de tbc_13\",TD!$A$115)","v":15}]
[null,null,4,"2º sesión educativa y demostrativa",{"$f":"GETPIVOTDATA(\"Suma de tbc_14\",TD!$A$115)","v":1},{"$f":"GETPIVOTDATA(\"Suma de tbc_15\",TD!$A$115)","v":13},{"$f":"GETPIVOTDATA(\"Suma de tbc_16\",TD!$A$115)","v":1},{"$f":"GETPIVOTDATA(\"Suma de tbc_17\",TD!$A$115)","v":13}]
[]
[null,null,null,"trazador",{"$f":"F37","v":13}]
[]
[null,null,"3. DOCENTES DE INSTITUCIONES EDUCATIVAS DESARROLLAN\nACCIONES PARA LA PROMOCIÓN DE PRÁCTICAS SALUDABLES Y LA PREVENCIÓN DE\nLA TUBERCULOSIS, VIH/SIDA"]
[null,null,"Incidencia con directivos y docentes de instituciones educativas:"]
[null,null,null,1,2,3,4]
[null,null,null,"TBC",null,"VIH/SIDA"]
[null,null,null,"Reunion","Participantes","Reunion","Participantes"]
[null,null,5,{"$f":"GETPIVOTDATA(\"Suma de tbc_18\",TD!$A$115)","v":2},{"$f":"GETPIVOTDATA(\"Suma de tbc_19\",TD!$A$115)","v":66},{"$f":"GETPIVOTDATA(\"Suma de tbc_20\",TD!$A$115)","v":4},{"$f":"GETPIVOTDATA(\"Suma de tbc_21\",TD!$A$115)","v":132}]
[]
[null,null,"Capacitación a docentes y directivos de instituciones educativas "]
[null,null,null,null,1,2,3,4,5,6,7,8]
[null,null,null,null,"TBC",null,null,null,"VIH/SIDA"]
[null,null,null,null,"NIVEL PRIMARIO",null,"NIVEL SECUNDARIO",null,"NIVEL PRIMARIO",null,"NIVEL SECUNDARIO"]
[null,null,null,"Nº Asistencias Técnicas","Nº","Participantes","Nº","Participantes","Nº","Participantes","Nº","Participantes"]
[null,null,6,"1º AT",{"$f":"GETPIVOTDATA(\"Suma de tbc_22\",TD!$A$115)","v":2},{"$f":"GETPIVOTDATA(\"Suma de tbc_23\",TD!$A$115)","v":46},{"$f":"GETPIVOTDATA(\"Suma de tbc_24\",TD!$A$115)","v":3},{"$f":"GETPIVOTDATA(\"Suma de tbc_25\",TD!$A$115)","v":98},{"$f":"GETPIVOTDATA(\"Suma de tbc_26\",TD!$A$115)","v":0},{"$f":"GETPIVOTDATA(\"Suma de tbc_27\",TD!$A$115)","v":0},{"$f":"GETPIVOTDATA(\"Suma de tbc_28\",TD!$A$115)","v":5},{"$f":"GETPIVOTDATA(\"Suma de tbc_29\",TD!$A$115)","v":164}]
[]
[null,null,null,"trazador",{"$f":"F53+H53","v":144}]
[]
[null,null,"Acompañamiento al docente en la implementación de proyectos y/o sesiones de aprendizaje"]
[null,null,null,null,1,2,3,4,5,6,7,8]
[null,null,null,null,"TBC",null,null,null,"VIH/SIDA"]
[null,null,null,null,"NIVEL PRIMARIO",null,"NIVEL SECUNDARIO",null,"NIVEL PRIMARIO",null,"NIVEL SECUNDARIO"]
[null,null,null,null,"Nº","Participantes","Nº","Participantes","Nº","Participantes","Nº","Participantes"]
[null,null,null,null,{"$f":"GETPIVOTDATA(\"Suma de tbc_30\",TD!$A$115)","v":0},{"$f":"GETPIVOTDATA(\"Suma de tbc_31\",TD!$A$115)","v":0},{"$f":"GETPIVOTDATA(\"Suma de tbc_32\",TD!$A$115)","v":2},{"$f":"GETPIVOTDATA(\"Suma de tbc_33\",TD!$A$115)","v":62},{"$f":"GETPIVOTDATA(\"Suma de tbc_34\",TD!$A$115)","v":0},{"$f":"GETPIVOTDATA(\"Suma de tbc_35\",TD!$A$115)","v":0},{"$f":"GETPIVOTDATA(\"Suma de tbc_36\",TD!$A$115)","v":0},{"$f":"GETPIVOTDATA(\"Suma de tbc_37\",TD!$A$115)","v":0}]
[]
[null,null,"Acompañamiento al personal directivo en las acciones de monitoreo pedagógico de los proyectos de  y/o sesiones de aprendizaje "]
[null,null,null,1,2,3,4,5,6,7,8]
[null,null,null,"TBC",null,null,null,"VIH/SIDA"]
[null,null,null,"NIVEL PRIMARIO",null,"NIVEL SECUNDARIO",null,"NIVEL PRIMARIO",null,"NIVEL SECUNDARIO"]
[null,null,null,"Reunion","Participantes","Reunion","Participantes","Reunion","Participantes","Reunion","Participantes"]
[null,null,7,{"$f":"GETPIVOTDATA(\"Suma de tbc_38\",TD!$A$115)","v":0},{"$f":"GETPIVOTDATA(\"Suma de tbc_39\",TD!$A$115)","v":0},{"$f":"GETPIVOTDATA(\"Suma de tbc_40\",TD!$A$115)","v":2},{"$f":"GETPIVOTDATA(\"Suma de tbc_41\",TD!$A$115)","v":64},{"$f":"GETPIVOTDATA(\"Suma de tbc_42\",TD!$A$115)","v":0},{"$f":"GETPIVOTDATA(\"Suma de tbc_43\",TD!$A$115)","v":0},{"$f":"GETPIVOTDATA(\"Suma de tbc_44\",TD!$A$115)","v":4},{"$f":"GETPIVOTDATA(\"Suma de tbc_45\",TD!$A$115)","v":128}]
[]
[null,null,"Acompañamiento al personal directivo en las acciones de monitoreo pedagógico de los proyectos de  y/o sesiones de aprendizaje "]
[]
[null,null,null,1,2,3,4,5,6,7,8]
[null,null,null,"TBC",null,null,null,"VIH/SIDA"]
[null,null,null,"NIVEL PRIMARIO",null,"NIVEL SECUNDARIO",null,"NIVEL PRIMARIO",null,"NIVEL SECUNDARIO"]
[null,null,null,"Reunion","Participantes","Reunion","Participantes","Reunion","Participantes","Reunion","Participantes"]
[null,null,8,{"$f":"GETPIVOTDATA(\"Suma de tbc_46\",TD!$A$115)","v":0},{"$f":"GETPIVOTDATA(\"Suma de tbc_47\",TD!$A$115)","v":0},{"$f":"GETPIVOTDATA(\"Suma de tbc_48\",TD!$A$115)","v":0},{"$f":"GETPIVOTDATA(\"Suma de tbc_49\",TD!$A$115)","v":0},{"$f":"GETPIVOTDATA(\"Suma de tbc_50\",TD!$A$115)","v":1},{"$f":"GETPIVOTDATA(\"Suma de tbc_51\",TD!$A$115)","v":1},{"$f":"GETPIVOTDATA(\"Suma de tbc_52\",TD!$A$115)","v":0},{"$f":"GETPIVOTDATA(\"Suma de tbc_53\",TD!$A$115)","v":0}]
[]
[null,null,"4. COMUNIDADES CON LIDERES CAPACITADOS DESARROLLAN\nVIGILANCIA COMUNITARIA EN FAVOR DE ENTORNOS Y PRACTICAS SALUDABLES Y LA\nPREVENCIÓN DE LA TUBERCULOSIS, VIH/SIDA"]
[]
[null,null,null,"FASE 1: PLANIFICACIÓN"]
[null,null,null,null,1,2,3,4]
[null,null,null,null,"TCB",null,"VIH SIDA"]
[null,null,null,"Tema","Nº","Nº COMUNIDADES","Nº","Nº COMUNIDADES"]
[null,null,9,"Conformación del equipo para la implementación de la vigilancia comunitaria",{"$f":"GETPIVOTDATA(\"Suma de tbc_46\",TD!$A$115)","v":0},null,{"$f":"GETPIVOTDATA(\"Suma de tbc_47\",TD!$A$115)","v":0}]
[null,null,10,"Identificación y selección de comunidades en riesgo para el desarrollo de la vigilancia comunitaria",{"$f":"GETPIVOTDATA(\"Suma de tbc_48\",TD!$A$115)","v":0},{"$f":"GETPIVOTDATA(\"Suma de tbc_49\",TD!$A$115)","v":0},{"$f":"GETPIVOTDATA(\"Suma de tbc_50\",TD!$A$115)","v":1},{"$f":"GETPIVOTDATA(\"Suma de tbc_51\",TD!$A$115)","v":1}]
[null,null,11,"Identificación de organizaciones comunitarias con base en el padrón del gobierno local, incluyendo a\nlos Agentes Comunitarios de Salud.",{"$f":"GETPIVOTDATA(\"Suma de tbc_52\",TD!$A$115)","v":0},null,{"$f":"GETPIVOTDATA(\"Suma de tbc_53\",TD!$A$115)","v":0}]
[null,null,12,"Selección de contenidos claves, instrumentos y metodología para vigilar",{"$f":"GETPIVOTDATA(\"Suma de tbc_54\",TD!$A$115)","v":0},null,{"$f":"GETPIVOTDATA(\"Suma de tbc_55\",TD!$A$115)","v":0}]
[]
[]
[null,null,"Capacitación en vigilancia comunitaria y prácticas y entornos saludables a agentes comunitarios y organizaciones comunitarias"]
[]
[null,null,null,"Para agentes comunitarios de salud (ACS):"]
[null,null,null,1,2,3,4,5,6,7,8]
[null,null,null,"TBC",null,null,null,"VIH"]
[null,null,null,"Para indicar Vigilancia Comunitaria",null,"Para prácticas saludables",null,"Para indicar Vigilancia Comunitaria",null,"Para prácticas saludables"]
[null,null,null,"Nº","Nº Participantes","Nº","Nº Participantes","Nº","Nº Participantes","Nº","Nº Participantes"]
[null,null,13,{"$f":"GETPIVOTDATA(\"Suma de tbc_56\",TD!$A$115)","v":1},{"$f":"GETPIVOTDATA(\"Suma de tbc_57\",TD!$A$115)","v":18},{"$f":"GETPIVOTDATA(\"Suma de tbc_58\",TD!$A$115)","v":0},{"$f":"GETPIVOTDATA(\"Suma de tbc_59\",TD!$A$115)","v":0},{"$f":"GETPIVOTDATA(\"Suma de tbc_60\",TD!$A$115)","v":0},{"$f":"GETPIVOTDATA(\"Suma de tbc_61\",TD!$A$115)","v":0},{"$f":"GETPIVOTDATA(\"Suma de tbc_62\",TD!$A$115)","v":0},{"$f":"GETPIVOTDATA(\"Suma de tbc_63\",TD!$A$115)","v":0}]
[]
[null,null,null,"Para organizaciones comunitarias"]
[]
[null,null,null,1,2,3,4,5,6,7,8]
[null,null,null,"TBC",null,null,null,"TBC"]
[null,null,null,"Para indicar Vigilancia Comunitaria",null,"Para prácticas saludables",null,"Para indicar Vigilancia Comunitaria",null,"Para prácticas saludables"]
[null,null,null,"Nº","Nº Participantes","Nº","Nº Participantes","Nº","Nº Participantes","Nº","Nº Participantes"]
[null,null,14,{"$f":"GETPIVOTDATA(\"Suma de tbc_64\",TD!$A$115)","v":0},{"$f":"GETPIVOTDATA(\"Suma de tbc_65\",TD!$A$115)","v":0},{"$f":"GETPIVOTDATA(\"Suma de tbc_66\",TD!$A$115)","v":0},{"$f":"GETPIVOTDATA(\"Suma de tbc_67\",TD!$A$115)","v":0},{"$f":"GETPIVOTDATA(\"Suma de tbc_68\",TD!$A$115)","v":0},{"$f":"GETPIVOTDATA(\"Suma de tbc_69\",TD!$A$115)","v":0},{"$f":"GETPIVOTDATA(\"Suma de tbc_70\",TD!$A$115)","v":0},{"$f":"GETPIVOTDATA(\"Suma de tbc_71\",TD!$A$115)","v":0}]
[]
[null,null,null,"FASE 2: EJECUCIÓN"]
[]
[null,null,null,"Aplicación de la vigilancia comunitaria "]
[]
[null,null,null,null,1,2,3,4]
[null,null,null,"Tema","TBC",null,"VIH-SIDA"]
[null,null,null,"Nº vigilancia ","Nº","Nº Participantes","Nº","Nº Participantes"]
[null,null,15," Nº intervenciones ",{"$f":"GETPIVOTDATA(\"Suma de tbc_72\",TD!$A$115)","v":0},{"$f":"GETPIVOTDATA(\"Suma de tbc_73\",TD!$A$115)","v":0},{"$f":"GETPIVOTDATA(\"Suma de tbc_74\",TD!$A$115)","v":0},{"$f":"GETPIVOTDATA(\"Suma de tbc_75\",TD!$A$115)","v":0}]
[null,null,16,"4º intervención ",{"$f":"GETPIVOTDATA(\"Suma de tbc_76\",TD!$A$115)","v":1},{"$f":"GETPIVOTDATA(\"Suma de tbc_77\",TD!$A$115)","v":2},{"$f":"GETPIVOTDATA(\"Suma de tbc_78\",TD!$A$115)","v":1},{"$f":"GETPIVOTDATA(\"Suma de tbc_79\",TD!$A$115)","v":2}]
[]
[null,null,null,"trazador",{"$f":"F116","v":2}]
[]
[null,null,null,"FASE 3: ACOMPAÑAMIENTO O ASISTENCIA TÉCNICA"]
[null,null,null,null,1,2,3,4]
[null,null,null,null,"TBC",null,"VIH SIDA"]
[null,null,null,null,"Reunion","Participantes","Reunion","Participantes"]
[null,null,24,"1° Asistencia Tecnica",{"$f":"GETPIVOTDATA(\"Suma de tbc_80\",TD!$A$115)","v":0},{"$f":"GETPIVOTDATA(\"Suma de tbc_81\",TD!$A$115)","v":0},{"$f":"GETPIVOTDATA(\"Suma de tbc_82\",TD!$A$115)","v":0},{"$f":"GETPIVOTDATA(\"Suma de tbc_83\",TD!$A$115)","v":0}]
[null,null,25,"2° Asistencia Tecnica",{"$f":"GETPIVOTDATA(\"Suma de tbc_84\",TD!$A$115)","v":0},{"$f":"GETPIVOTDATA(\"Suma de tbc_85\",TD!$A$115)","v":0},{"$f":"GETPIVOTDATA(\"Suma de tbc_86\",TD!$A$115)","v":0},{"$f":"GETPIVOTDATA(\"Suma de tbc_87\",TD!$A$115)","v":0}]
[]
[null,null,null,"FASE 4: EVALUACIÓN","NUEVO "]
[null,null,null,null,1,2,3,4]
[null,null,null,null,"TBC",null,"VIH SIDA"]
[null,null,null,null,"Reunion","Participantes","Reunion","Participantes"]
[null,null,26,"Evaluación",{"$f":"GETPIVOTDATA(\"Suma de tbc_88\",TD!$A$115)","v":0},{"$f":"GETPIVOTDATA(\"Suma de tbc_89\",TD!$A$115)","v":0},{"$f":"GETPIVOTDATA(\"Suma de tbc_90\",TD!$A$115)","v":0},{"$f":"GETPIVOTDATA(\"Suma de tbc_91\",TD!$A$115)","v":0}]
[]
[null,null,"5. MUNICIPIOS IMPLEMENTAN ACCIONES PARA MEJORAR O\nMITIGAR LAS CONDICIONES QUE GENERAN RIESGO PARA ENFERMAR DE\nTUBERCULOSIS Y VIH/SIDA SEGÚN DISTRITOS/ PROVINCIAS PRIORIZADOS"]
[]
[null,null,null,"FASE 1: PLANIFICACIÓN"]
[null,null,null,null,1,2]
[null,null,null,null,"TBC","VIH/SIDA"]
[null,null,27,"Reunión con el gobierno local, actores sociales públicos y privados en el comité multisectorial\no la que hagan sus veces para integrar la información relacionada a la situación de la\ntuberculosis y el VIH/SIDA –Sala Municipal de Salud.",{"$f":"GETPIVOTDATA(\"Suma de tbc_92\",TD!$A$115)","v":0},{"$f":"GETPIVOTDATA(\"Suma de tbc_93\",TD!$A$115)","v":0}]
[null,null,28,"Reunión para sectorización y priorización territorial homologada entre Salud y el gobierno local,\ntomando como referencia el catastro municipal. ",{"$f":"GETPIVOTDATA(\"Suma de tbc_94\",TD!$A$115)","v":0},{"$f":"GETPIVOTDATA(\"Suma de tbc_95\",TD!$A$115)","v":0}]
[null,null,29,"Reunión para mapeo de actores sociales (actividades y recursos según actor social).",{"$f":"GETPIVOTDATA(\"Suma de tbc_96\",TD!$A$115)","v":0},{"$f":"GETPIVOTDATA(\"Suma de tbc_97\",TD!$A$115)","v":0}]
[null,null,30,"Reunión de socialización periódica de información integrada, con el gobierno local, actores\nsociales públicos y privados en el comité multisectorial o la que hagan sus veces (trimestral)",{"$f":"GETPIVOTDATA(\"Suma de tbc_98\",TD!$A$115)","v":0},{"$f":"GETPIVOTDATA(\"Suma de tbc_99\",TD!$A$115)","v":0}]
[]
[null,null,null,"FASE 2: ASISTENCIA TÉCNICA"]
[]
[null,null,null,null,1,2,3,4]
[null,null,null,null,"TBC",null,"VIH SIDA"]
[null,null,null,null,"Reunion","Participantes","Reunion","Participantes"]
[null,null,31,"(1) Plan de acción",{"$f":"GETPIVOTDATA(\"Suma de tbc_100\",TD!$A$115)","v":0},{"$f":"GETPIVOTDATA(\"Suma de tbc_101\",TD!$A$115)","v":0},{"$f":"GETPIVOTDATA(\"Suma de tbc_102\",TD!$A$115)","v":0},{"$f":"GETPIVOTDATA(\"Suma de tbc_103\",TD!$A$115)","v":0}]
[null,null,32,"(2) Programación presupuestal",{"$f":"GETPIVOTDATA(\"Suma de tbc_104\",TD!$A$115)","v":0},{"$f":"GETPIVOTDATA(\"Suma de tbc_105\",TD!$A$115)","v":0},{"$f":"GETPIVOTDATA(\"Suma de tbc_106\",TD!$A$115)","v":0},{"$f":"GETPIVOTDATA(\"Suma de tbc_107\",TD!$A$115)","v":0}]
[null,null,33,"(3) Para los casos que se haya elaborado el Plan de acción y la Programación",{"$f":"GETPIVOTDATA(\"Suma de tbc_108\",TD!$A$115)","v":0},{"$f":"GETPIVOTDATA(\"Suma de tbc_109\",TD!$A$115)","v":0},{"$f":"GETPIVOTDATA(\"Suma de tbc_110\",TD!$A$115)","v":0},{"$f":"GETPIVOTDATA(\"Suma de tbc_111\",TD!$A$115)","v":0}]
[]
[]
[null,null,null,"FASE 3: MONITOREO Y EVALUACIÓN"]
[]
[null,null,null,"MONITOREO"]
[null,null,null,null,1,2,3,4]
[null,null,null,null,"TBC",null,"VIH-SIDA"]
[null,null,null,"Nº Monitoreo","Número ","Participantes","Número ","Participantes"]
[null,null,34,"1º Monitoreo ",{"$f":"GETPIVOTDATA(\"Suma de tbc_112\",TD!$A$115)","v":0},{"$f":"GETPIVOTDATA(\"Suma de tbc_113\",TD!$A$115)","v":0},{"$f":"GETPIVOTDATA(\"Suma de tbc_114\",TD!$A$115)","v":0},{"$f":"GETPIVOTDATA(\"Suma de tbc_115\",TD!$A$115)","v":0}]
[null,null,35,"2º Monitoreo ",{"$f":"GETPIVOTDATA(\"Suma de tbc_116\",TD!$A$115)","v":0},{"$f":"GETPIVOTDATA(\"Suma de tbc_117\",TD!$A$115)","v":0},{"$f":"GETPIVOTDATA(\"Suma de tbc_118\",TD!$A$115)","v":0},{"$f":"GETPIVOTDATA(\"Suma de tbc_119\",TD!$A$115)","v":0}]
[]
[null,null,null,"EVALUACIÓN"]
[]
[null,null,null,1,2,3,4,5,6,7,8]
[null,null,null,"TBC",null,null,null,"VIH-SIDA"]
[null,null,null,"Si cumplió más del 50% de actividades programadas",null,"Si cumplió menos del 50% de actividades programadas",null,"Si cumplió más del 50% de actividades programadas",null,"Si cumplió menos del 50% de actividades programadas"]
[null,null,null,"Número ","Participantes","Número ","Participantes","Número ","Participantes","Número ","Participantes"]
[null,null,36,{"$f":"GETPIVOTDATA(\"Suma de tbc_120\",TD!$A$115)","v":0},{"$f":"GETPIVOTDATA(\"Suma de tbc_121\",TD!$A$115)","v":0},{"$f":"GETPIVOTDATA(\"Suma de tbc_122\",TD!$A$115)","v":0},{"$f":"GETPIVOTDATA(\"Suma de tbc_123\",TD!$A$115)","v":0},{"$f":"GETPIVOTDATA(\"Suma de tbc_124\",TD!$A$115)","v":0},{"$f":"GETPIVOTDATA(\"Suma de tbc_125\",TD!$A$115)","v":0},{"$f":"GETPIVOTDATA(\"Suma de tbc_126\",TD!$A$115)","v":0},{"$f":"GETPIVOTDATA(\"Suma de tbc_127\",TD!$A$115)","v":0}]
[]
[null,null,null,"trazador",{"$f":"D168+F168","v":0}]

{"sheet":"PP017","index":6,"n_rows":414,"n_cols":21,"rows_kept":414,"cut":false,"hidden":false,"merged":[[5,1,5,26],[0,1,0,26],[1,1,1,26],[2,1,2,26],[3,1,3,26],[4,1,4,26],[7,5,7,8],[7,12,7,16],[7,20,7,22],[9,5,9,8],[9,12,9,16],[9,20,9,22],[11,5,11,8],[11,12,11,17],[14,0,343,0],[14,1,43,1],[46,1,343,1],[50,4,50,7],[63,4,63,7],[74,4,74,5],[74,6,74,7],[87,4,87,5],[87,6,87,7],[125,4,125,5],[125,6,125,7],[125,8,125,9],[125,10,125,11],[125,14,125,15],[125,16,125,17],[125,18,125,19],[136,4,136,5],[136,6,136,7],[136,8,136,9],[136,10,136,11],[136,12,136,13],[136,14,136,15],[136,16,136,17],[125,12,125,13],[347,10,347,11],[354,4,354,5],[191,4,191,7],[136,18,136,19],[146,4,146,5],[146,6,146,7],[146,8,146,9],[146,10,146,11],[146,12,146,13],[156,4,156,5],[156,6,156,7],[156,8,156,9],[156,10,156,11],[156,12,156,13],[370,4,370,5],[370,6,370,7],[370,8,370,9],[354,12,354,13],[206,4,206,7],[319,4,319,5],[319,6,319,7],[319,8,319,9],[319,10,319,11],[332,4,332,5],[332,6,332,7],[332,8,332,9],[332,10,332,11],[347,4,347,5],[347,6,347,7],[347,8,347,9],[310,3,311,3],[407,3,408,3],[407,4,407,5],[407,6,407,7],[407,8,407,9],[383,3,384,3],[383,4,383,5],[383,6,383,7],[383,8,383,9],[394,3,395,3],[394,4,394,5],[394,6,394,7],[394,8,394,9],[361,4,361,6],[361,7,361,9],[370,3,371,3]]}
[null,"DIRECCION REGIONAL DE SALUD CUSCO"]
[null,"DIRECCION EJECUTIVA DE INTELIGENCIA SANITARIA"]
[null,"DIRECCION DE ESTADISTICA Y TELECOMUNICACIONES"]
[null,"PROMOCION DE LA SALUD"]
[null,"INFORME OPERACIONAL MENSUAL"]
[null,"METAXENICAS Y ZOONOSIS"]
[]
[null,null,"RED DE SALUD",null,null,{"$f":"TD!F3","v":"(All)"},null,null,null,null,"PROVINCIA",null,{"$f":"TD!F6","v":"(All)"},null,null,null,null,null,"AÑO :",null,{"$f":"TD!C10","v":"2024"}]
[]
[null,null,"MICRO RED",null,null,{"$f":"TD!F4","v":"(All)"},null,null,null,null,"DISTRITO",null,{"$f":"TD!F7","v":"(All)"},null,null,null,null,null,"MES :",null,{"$f":"TD!O17","v":"ENERO - DICIEMBRE"}]
[]
[null,null,"ESTABLECIMIENTO",null,null,{"$f":"TD!F5","v":"(All)"},null,null,null,null,"U.E.",null,{"$f":"TD!F8","v":"(All)"}]
[]
[]
["PROGRAMA PRESUPUESTAL ENFERMEDADES METAXENICAS Y ZOONOTICAS 017","ACTIVIDAD FAMILIAS","1. FAMILIAS QUE DESARROLLAN PRÁCTICAS SALUDABLES PARA LA PREVENCIÓN DE LAS ENFERMEDADES METAXÉNICAS"]
[]
[null,null,null,"Consejeria (dengue)","NUEVO"]
[null,null,null,null,1]
[null,null,null,"Tematica","Nº"]
[null,null,1,"Sensibilizar a la familia sobre la importancia de\nla apertura de sus casas para intervenciones sanitaria",{"$f":"GETPIVOTDATA(\"Suma de metax01\",TD!$A$192)","v":0}]
[null,null,2,"Higiene y ordenamiento de la vivienda\npara eliminación de criaderos\n",{"$f":"GETPIVOTDATA(\"Suma de metax02\",TD!$A$192)","v":0}]
[]
[null,null,null,"Sesión demostrativa"]
[]
[null,null,null,null,1,2,3,4,5,6,7,8]
[null,null,null,"Sesión demostrativa","Malaria (01)","Dengue (05)","Chikungunya (02)","Zika (03)","Bartonelosis (06)","Fiebre Amarilla (07)","Chagas (08)","Leishmaniosis (09)"]
[null,null,3,"1º Sesión ",{"$f":"GETPIVOTDATA(\"Suma de metax03\",TD!$A$192)","v":0},{"$f":"GETPIVOTDATA(\"Suma de metax04\",TD!$A$192)","v":0},{"$f":"GETPIVOTDATA(\"Suma de metax05\",TD!$A$192)","v":0},{"$f":"GETPIVOTDATA(\"Suma de metax06\",TD!$A$192)","v":0},{"$f":"GETPIVOTDATA(\"Suma de metax07\",TD!$A$192)","v":0},{"$f":"GETPIVOTDATA(\"Suma de metax08\",TD!$A$192)","v":78},{"$f":"GETPIVOTDATA(\"Suma de metax09\",TD!$A$192)","v":0},{"$f":"GETPIVOTDATA(\"Suma de metax10\",TD!$A$192)","v":0}]
[null,null,4,"2º Sesión ",{"$f":"GETPIVOTDATA(\"Suma de metax11\",TD!$A$192)","v":0},{"$f":"GETPIVOTDATA(\"Suma de metax12\",TD!$A$192)","v":0},{"$f":"GETPIVOTDATA(\"Suma de metax13\",TD!$A$192)","v":0},{"$f":"GETPIVOTDATA(\"Suma de metax14\",TD!$A$192)","v":0},{"$f":"GETPIVOTDATA(\"Suma de metax15\",TD!$A$192)","v":0},{"$f":"GETPIVOTDATA(\"Suma de metax16\",TD!$A$192)","v":78},{"$f":"GETPIVOTDATA(\"Suma de metax17\",TD!$A$192)","v":0},{"$f":"GETPIVOTDATA(\"Suma de metax18\",TD!$A$192)","v":0}]
[]
[null,null,null,"trazador",{"$f":"E28+F28","v":0}]
[]
[null,null,"2. FAMILIAS QUE DESARROLLAN PRÁCTICAS SALUDABLES PARA LA PREVENCIÓN DE LAS ENFERMEDADES ZOONOTICAS"]
[]
[null,null,null,"Consejeria (rabia)","NUEVO"]
[null,null,null,null,1]
[null,null,null,"Tematica","Nº"]
[null,null,5,"Consejeria triada preventiva de rabia",{"$f":"GETPIVOTDATA(\"Suma de metax20\",TD!$A$192)","v":0}]
[]
[null,null,null,"Sesión educativa"]
[null,null,null,null,1,2,3,4,5]
[null,null,null,"Sesión demostrativa","Rabia (04)","Peste (010)","Leptospirosis (011)","Tifus (012)","Equinococosis (013)"]
[null,null,6,"1º Sesión ",{"$f":"GETPIVOTDATA(\"Suma de metax21\",TD!$A$192)","v":80},{"$f":"GETPIVOTDATA(\"Suma de metax22\",TD!$A$192)","v":0},{"$f":"GETPIVOTDATA(\"Suma de metax23\",TD!$A$192)","v":0},{"$f":"GETPIVOTDATA(\"Suma de metax24\",TD!$A$192)","v":0},{"$f":"GETPIVOTDATA(\"Suma de metax25\",TD!$A$192)","v":0}]
[null,null,7,"2º Sesión ",{"$f":"GETPIVOTDATA(\"Suma de metax26\",TD!$A$192)","v":79},{"$f":"GETPIVOTDATA(\"Suma de metax27\",TD!$A$192)","v":0},{"$f":"GETPIVOTDATA(\"Suma de metax28\",TD!$A$192)","v":0},{"$f":"GETPIVOTDATA(\"Suma de metax29\",TD!$A$192)","v":0},{"$f":"GETPIVOTDATA(\"Suma de metax30\",TD!$A$192)","v":0}]
[]
[null,null,null,"trazador",{"$f":"E43","v":79}]
[]
[null,"ACTIVIDAD VIGILANCIA COMUNITARIA","3. COMUNIDADES PRIORIZADAS EN EL DISTRITO QUE ESTÁN\nIMPLEMENTANDO LA VIGILANCIA COMUNITARIA ASOCIADA A ENFERMEDADES\nMETAXÉNICAS Y ZOONOTICAS"]
[null,null,null,"La implementación de la vigilancia comunitaria tiene los siguientes procesos"]
[null,null,null,"Metaxenicas "]
[null,null,null,null,1,2,3,4]
[null,null,null,null,"Tipo de proceso"]
[null,null,null,"Tematica","Conformación del equipo para la implementación de la Vigilancia Comunitaria.","Selección de comunidades a vigilar.","Nº DE COMUNIDADES","Elección de instrumentos y metodología para vigilar"]
[null,null,8,"Malaria (1)",{"$f":"GETPIVOTDATA(\"Suma de metax32\",TD!$A$192)","v":0},{"$f":"GETPIVOTDATA(\"Suma de metax33\",TD!$A$192)","v":0},{"$f":"GETPIVOTDATA(\"Suma de metax34\",TD!$A$192)","v":0},{"$f":"GETPIVOTDATA(\"Suma de metax35\",TD!$A$192)","v":0}]
[null,null,9,"Dengue (5)",{"$f":"GETPIVOTDATA(\"Suma de metax36\",TD!$A$192)","v":0},{"$f":"GETPIVOTDATA(\"Suma de metax37\",TD!$A$192)","v":0},{"$f":"GETPIVOTDATA(\"Suma de metax38\",TD!$A$192)","v":0},{"$f":"GETPIVOTDATA(\"Suma de metax39\",TD!$A$192)","v":0}]
[null,null,10,"Chikungunya (2)",{"$f":"GETPIVOTDATA(\"Suma de metax40\",TD!$A$192)","v":0},{"$f":"GETPIVOTDATA(\"Suma de metax41\",TD!$A$192)","v":0},{"$f":"GETPIVOTDATA(\"Suma de metax42\",TD!$A$192)","v":0},{"$f":"GETPIVOTDATA(\"Suma de metax43\",TD!$A$192)","v":0}]
[null,null,11,"Zika (3)",{"$f":"GETPIVOTDATA(\"Suma de metax44\",TD!$A$192)","v":0},{"$f":"GETPIVOTDATA(\"Suma de metax45\",TD!$A$192)","v":0},{"$f":"GETPIVOTDATA(\"Suma de metax46\",TD!$A$192)","v":0},{"$f":"GETPIVOTDATA(\"Suma de metax47\",TD!$A$192)","v":0}]
[null,null,12,"Bartonelosis (6)",{"$f":"GETPIVOTDATA(\"Suma de metax48\",TD!$A$192)","v":0},{"$f":"GETPIVOTDATA(\"Suma de metax49\",TD!$A$192)","v":0},{"$f":"GETPIVOTDATA(\"Suma de metax50\",TD!$A$192)","v":0},{"$f":"GETPIVOTDATA(\"Suma de metax51\",TD!$A$192)","v":0}]
[null,null,13,"Fiebre Amarilla (7)",{"$f":"GETPIVOTDATA(\"Suma de metax52\",TD!$A$192)","v":0},{"$f":"GETPIVOTDATA(\"Suma de metax53\",TD!$A$192)","v":0},{"$f":"GETPIVOTDATA(\"Suma de metax54\",TD!$A$192)","v":0},{"$f":"GETPIVOTDATA(\"Suma de metax55\",TD!$A$192)","v":0}]
[null,null,14,"Chagas (8)",{"$f":"GETPIVOTDATA(\"Suma de metax56\",TD!$A$192)","v":0},{"$f":"GETPIVOTDATA(\"Suma de metax57\",TD!$A$192)","v":0},{"$f":"GETPIVOTDATA(\"Suma de metax58\",TD!$A$192)","v":0},{"$f":"GETPIVOTDATA(\"Suma de metax59\",TD!$A$192)","v":0}]
[null,null,15,"Leishmaniosis (9)",{"$f":"GETPIVOTDATA(\"Suma de metax60\",TD!$A$192)","v":0},{"$f":"GETPIVOTDATA(\"Suma de metax61\",TD!$A$192)","v":0},{"$f":"GETPIVOTDATA(\"Suma de metax62\",TD!$A$192)","v":0},{"$f":"GETPIVOTDATA(\"Suma de metax63\",TD!$A$192)","v":0}]
[]
[null,null,null,"Zoonoticas"]
[null,null,null,null,1,2,3,4]
[null,null,null,null,"Tipo de proceso"]
[null,null,null,"Tematica","Conformación del equipo para la implementación de la Vigilancia Comunitaria.","Selección de comunidades a vigilar.","Nº DE COMUNIDADES","Elección de instrumentos y metodología para vigilar"]
[null,null,16,"Rabia (4)",{"$f":"GETPIVOTDATA(\"Suma de metax64\",TD!$A$192)","v":0},{"$f":"GETPIVOTDATA(\"Suma de metax65\",TD!$A$192)","v":0},{"$f":"GETPIVOTDATA(\"Suma de metax66\",TD!$A$192)","v":0},{"$f":"GETPIVOTDATA(\"Suma de metax67\",TD!$A$192)","v":0}]
[null,null,17,"Peste (10)",{"$f":"GETPIVOTDATA(\"Suma de metax68\",TD!$A$192)","v":0},{"$f":"GETPIVOTDATA(\"Suma de metax69\",TD!$A$192)","v":0},{"$f":"GETPIVOTDATA(\"Suma de metax70\",TD!$A$192)","v":0},{"$f":"GETPIVOTDATA(\"Suma de metax71\",TD!$A$192)","v":0}]
[null,null,18,"Leptospirosis (11)",{"$f":"GETPIVOTDATA(\"Suma de metax72\",TD!$A$192)","v":0},{"$f":"GETPIVOTDATA(\"Suma de metax73\",TD!$A$192)","v":0},{"$f":"GETPIVOTDATA(\"Suma de metax74\",TD!$A$192)","v":0},{"$f":"GETPIVOTDATA(\"Suma de metax75\",TD!$A$192)","v":0}]
[null,null,19,"Tifus (12)",{"$f":"GETPIVOTDATA(\"Suma de metax76\",TD!$A$192)","v":0},{"$f":"GETPIVOTDATA(\"Suma de metax77\",TD!$A$192)","v":0},{"$f":"GETPIVOTDATA(\"Suma de metax78\",TD!$A$192)","v":0},{"$f":"GETPIVOTDATA(\"Suma de metax79\",TD!$A$192)","v":0}]
[null,null,20,"Equinococosis (13)",{"$f":"GETPIVOTDATA(\"Suma de metax_76\",TD!$A$192)","v":0},{"$f":"GETPIVOTDATA(\"Suma de metax_77\",TD!$A$192)","v":0},{"$f":"GETPIVOTDATA(\"Suma de metax_77\",TD!$A$192)","v":0},{"$f":"GETPIVOTDATA(\"Suma de metax_77\",TD!$A$192)","v":0}]
[]
[null,null,null,"Taller de capacitación a líderes comunitarios (LC) y agentes comunitarias de salud (ACS)"]
[null,null,null,"Metaxenicas "]
[null,null,null,null,1,2,3,4]
[null,null,null,null,"Taller de Líderes comunitarios",null,"Talleres de Agentes Comunitarios de salud (PDS)"]
[null,null,null,"Tematica","N° Talleres","Participantes","N° Talleres","Participantes"]
[null,null,21,"Malaria (1)",{"$f":"GETPIVOTDATA(\"Suma de metax80\",TD!$A$192)","v":0},{"$f":"GETPIVOTDATA(\"Suma de metax81\",TD!$A$192)","v":0},{"$f":"GETPIVOTDATA(\"Suma de metax82\",TD!$A$192)","v":0},{"$f":"GETPIVOTDATA(\"Suma de metax83\",TD!$A$192)","v":0}]
[null,null,22,"Dengue (5)",{"$f":"GETPIVOTDATA(\"Suma de metax84\",TD!$A$192)","v":0},{"$f":"GETPIVOTDATA(\"Suma de metax85\",TD!$A$192)","v":0},{"$f":"GETPIVOTDATA(\"Suma de metax86\",TD!$A$192)","v":0},{"$f":"GETPIVOTDATA(\"Suma de metax87\",TD!$A$192)","v":0}]
[null,null,23,"Chikungunya (2)",{"$f":"GETPIVOTDATA(\"Suma de metax88\",TD!$A$192)","v":0},{"$f":"GETPIVOTDATA(\"Suma de metax89\",TD!$A$192)","v":0},{"$f":"GETPIVOTDATA(\"Suma de metax90\",TD!$A$192)","v":0},{"$f":"GETPIVOTDATA(\"Suma de metax91\",TD!$A$192)","v":0}]
[null,null,24,"Zika (3)",{"$f":"GETPIVOTDATA(\"Suma de metax92\",TD!$A$192)","v":0},{"$f":"GETPIVOTDATA(\"Suma de metax93\",TD!$A$192)","v":0},{"$f":"GETPIVOTDATA(\"Suma de metax94\",TD!$A$192)","v":0},{"$f":"GETPIVOTDATA(\"Suma de metax95\",TD!$A$192)","v":0}]
[null,null,25,"Bartonelosis (6)",{"$f":"GETPIVOTDATA(\"Suma de metax96\",TD!$A$192)","v":0},{"$f":"GETPIVOTDATA(\"Suma de metax97\",TD!$A$192)","v":0},{"$f":"GETPIVOTDATA(\"Suma de metax98\",TD!$A$192)","v":0},{"$f":"GETPIVOTDATA(\"Suma de metax99\",TD!$A$192)","v":0}]
[null,null,26,"Fiebre Amarilla (7)",{"$f":"GETPIVOTDATA(\"Suma de metax100\",TD!$A$192)","v":0},{"$f":"GETPIVOTDATA(\"Suma de metax101\",TD!$A$192)","v":0},{"$f":"GETPIVOTDATA(\"Suma de metax102\",TD!$A$192)","v":0},{"$f":"GETPIVOTDATA(\"Suma de metax103\",TD!$A$192)","v":0}]
[null,null,27,"Chagas (8)",{"$f":"GETPIVOTDATA(\"Suma de metax104\",TD!$A$192)","v":0},{"$f":"GETPIVOTDATA(\"Suma de metax105\",TD!$A$192)","v":0},{"$f":"GETPIVOTDATA(\"Suma de metax106\",TD!$A$192)","v":0},{"$f":"GETPIVOTDATA(\"Suma de metax107\",TD!$A$192)","v":0}]
[null,null,28,"Leishmaniosis (9)",{"$f":"GETPIVOTDATA(\"Suma de metax108\",TD!$A$192)","v":0},{"$f":"GETPIVOTDATA(\"Suma de metax109\",TD!$A$192)","v":0},{"$f":"GETPIVOTDATA(\"Suma de metax110\",TD!$A$192)","v":0},{"$f":"GETPIVOTDATA(\"Suma de metax111\",TD!$A$192)","v":0}]
[]
[null,null,null,"Zoonoticas"]
[null,null,null,null,1,2,3,4]
[null,null,null,null,"Taller de Líderes comunitarios",null,"Talleres de Agentes Comunitarios de salud (PDS)"]
[null,null,null,"Tematica","N° Talleres","Participantes","N° Talleres","Participantes"]
[null,null,29,"Rabia (4)",{"$f":"GETPIVOTDATA(\"Suma de metax112\",TD!$A$192)","v":0},{"$f":"GETPIVOTDATA(\"Suma de metax113\",TD!$A$192)","v":0},{"$f":"GETPIVOTDATA(\"Suma de metax114\",TD!$A$192)","v":0},{"$f":"GETPIVOTDATA(\"Suma de metax115\",TD!$A$192)","v":0}]
[null,null,30,"Peste (10)",{"$f":"GETPIVOTDATA(\"Suma de metax116\",TD!$A$192)","v":0},{"$f":"GETPIVOTDATA(\"Suma de metax117\",TD!$A$192)","v":0},{"$f":"GETPIVOTDATA(\"Suma de metax118\",TD!$A$192)","v":0},{"$f":"GETPIVOTDATA(\"Suma de metax119\",TD!$A$192)","v":0}]
[null,null,31,"Leptospirosis (11)",{"$f":"GETPIVOTDATA(\"Suma de metax120\",TD!$A$192)","v":0},{"$f":"GETPIVOTDATA(\"Suma de metax121\",TD!$A$192)","v":0},{"$f":"GETPIVOTDATA(\"Suma de metax122\",TD!$A$192)","v":0},{"$f":"GETPIVOTDATA(\"Suma de metax123\",TD!$A$192)","v":0}]
[null,null,32,"Tifus (12)",{"$f":"GETPIVOTDATA(\"Suma de metax124\",TD!$A$192)","v":0},{"$f":"GETPIVOTDATA(\"Suma de metax125\",TD!$A$192)","v":0},{"$f":"GETPIVOTDATA(\"Suma de metax126\",TD!$A$192)","v":0},{"$f":"GETPIVOTDATA(\"Suma de metax127\",TD!$A$192)","v":0}]
[null,null,33,"Equinococosis (13)",{"$f":"GETPIVOTDATA(\"Suma de metax_124\",TD!$A$192)","v":0},{"$f":"GETPIVOTDATA(\"Suma de metax_125\",TD!$A$192)","v":0},{"$f":"GETPIVOTDATA(\"Suma de metax_126\",TD!$A$192)","v":0},{"$f":"GETPIVOTDATA(\"Suma de metax_127\",TD!$A$192)","v":0}]
[]
[null,null,null,"Vigilancia comunitaria de puntos Críticos Identificados (PCI)"]
[]
[null,null,null,"Metaxenicas "]
[null,null,null,null,1,2,3,4]
[null,null,null,"Tematica","1º INTERVENCIÓN ","2º INTERVENCIÓN ","3º INTERVENCIÓN ","4º INTERVENCIÓN "]
[null,null,34,"Malaria (1)",{"$f":"GETPIVOTDATA(\"Suma de metax128\",TD!$A$192)","v":0},{"$f":"GETPIVOTDATA(\"Suma de metax129\",TD!$A$192)","v":0},{"$f":"GETPIVOTDATA(\"Suma de metax130\",TD!$A$192)","v":0},{"$f":"GETPIVOTDATA(\"Suma de metax131\",TD!$A$192)","v":0}]
[null,null,35,"Dengue (5)",{"$f":"GETPIVOTDATA(\"Suma de metax132\",TD!$A$192)","v":0},{"$f":"GETPIVOTDATA(\"Suma de metax133\",TD!$A$192)","v":0},{"$f":"GETPIVOTDATA(\"Suma de metax134\",TD!$A$192)","v":0},{"$f":"GETPIVOTDATA(\"Suma de metax135\",TD!$A$192)","v":0}]
[null,null,36,"Chikungunya (2)",{"$f":"GETPIVOTDATA(\"Suma de metax136\",TD!$A$192)","v":0},{"$f":"GETPIVOTDATA(\"Suma de metax137\",TD!$A$192)","v":0},{"$f":"GETPIVOTDATA(\"Suma de metax138\",TD!$A$192)","v":0},{"$f":"GETPIVOTDATA(\"Suma de metax139\",TD!$A$192)","v":0}]
[null,null,37,"Zika (3)",{"$f":"GETPIVOTDATA(\"Suma de metax140\",TD!$A$192)","v":0},{"$f":"GETPIVOTDATA(\"Suma de metax141\",TD!$A$192)","v":0},{"$f":"GETPIVOTDATA(\"Suma de metax142\",TD!$A$192)","v":0},{"$f":"GETPIVOTDATA(\"Suma de metax143\",TD!$A$192)","v":0}]
[null,null,38,"Bartonelosis (6)",{"$f":"GETPIVOTDATA(\"Suma de metax144\",TD!$A$192)","v":0},{"$f":"GETPIVOTDATA(\"Suma de metax145\",TD!$A$192)","v":0},{"$f":"GETPIVOTDATA(\"Suma de metax146\",TD!$A$192)","v":0},{"$f":"GETPIVOTDATA(\"Suma de metax147\",TD!$A$192)","v":0}]
[null,null,39,"Fiebre Amarilla (7)",{"$f":"GETPIVOTDATA(\"Suma de metax148\",TD!$A$192)","v":0},{"$f":"GETPIVOTDATA(\"Suma de metax149\",TD!$A$192)","v":0},{"$f":"GETPIVOTDATA(\"Suma de metax150\",TD!$A$192)","v":0},{"$f":"GETPIVOTDATA(\"Suma de metax151\",TD!$A$192)","v":0}]
[null,null,40,"Chagas (8)",{"$f":"GETPIVOTDATA(\"Suma de metax152\",TD!$A$192)","v":0},{"$f":"GETPIVOTDATA(\"Suma de metax153\",TD!$A$192)","v":0},{"$f":"GETPIVOTDATA(\"Suma de metax154\",TD!$A$192)","v":0},{"$f":"GETPIVOTDATA(\"Suma de metax155\",TD!$A$192)","v":0}]
[null,null,41,"Leishmaniosis (9)",{"$f":"GETPIVOTDATA(\"Suma de metax156\",TD!$A$192)","v":0},{"$f":"GETPIVOTDATA(\"Suma de metax157\",TD!$A$192)","v":0},{"$f":"GETPIVOTDATA(\"Suma de metax158\",TD!$A$192)","v":0},{"$f":"GETPIVOTDATA(\"Suma de metax159\",TD!$A$192)","v":0}]
[]
[null,null,null,"Zoonoticas"]
[null,null,null,null,1,2,3,4]
[null,null,null,"Tematica","1º INTERVENCIÓN ","2º INTERVENCIÓN ","3º INTERVENCIÓN ","4º INTERVENCIÓN "]
[null,null,42,"Rabia (4)",{"$f":"GETPIVOTDATA(\"Suma de metax160\",TD!$A$192)","v":0},{"$f":"GETPIVOTDATA(\"Suma de metax161\",TD!$A$192)","v":0},{"$f":"GETPIVOTDATA(\"Suma de metax162\",TD!$A$192)","v":0},{"$f":"GETPIVOTDATA(\"Suma de metax163\",TD!$A$192)","v":0}]
[null,null,43,"Peste (10)",{"$f":"GETPIVOTDATA(\"Suma de metax164\",TD!$A$192)","v":0},{"$f":"GETPIVOTDATA(\"Suma de metax165\",TD!$A$192)","v":0},{"$f":"GETPIVOTDATA(\"Suma de metax166\",TD!$A$192)","v":0},{"$f":"GETPIVOTDATA(\"Suma de metax167\",TD!$A$192)","v":0}]
[null,null,44,"Leptospirosis (11)",{"$f":"GETPIVOTDATA(\"Suma de metax168\",TD!$A$192)","v":0},{"$f":"GETPIVOTDATA(\"Suma de metax169\",TD!$A$192)","v":0},{"$f":"GETPIVOTDATA(\"Suma de metax170\",TD!$A$192)","v":0},{"$f":"GETPIVOTDATA(\"Suma de metax171\",TD!$A$192)","v":0}]
[null,null,45,"Tifus (12)",{"$f":"GETPIVOTDATA(\"Suma de metax172\",TD!$A$192)","v":0},{"$f":"GETPIVOTDATA(\"Suma de metax173\",TD!$A$192)","v":0},{"$f":"GETPIVOTDATA(\"Suma de metax174\",TD!$A$192)","v":0},{"$f":"GETPIVOTDATA(\"Suma de metax175\",TD!$A$192)","v":0}]
[null,null,46,"Equinococosis (13)",{"$f":"GETPIVOTDATA(\"Suma de metax176\",TD!$A$192)","v":0},{"$f":"GETPIVOTDATA(\"Suma de metax177\",TD!$A$192)","v":0},{"$f":"GETPIVOTDATA(\"Suma de metax178\",TD!$A$192)","v":0},{"$f":"GETPIVOTDATA(\"Suma de metax179\",TD!$A$192)","v":0}]
[]
[]
[null,null,null,"trazador",{"$f":"H102+H113","v":0}]
[]
[null,null,null,"Acciones de movilización comunitaria -Ejecución de campaña de recojo y eliminación de inservibles "]
[]
[null,null,null,"Metaxenicas "]
[null,null,null,null,1,2,3,4,5,6,7,8,9,10,11,12,13,14,15,16]
[null,null,null,null,"Malaria (1)",null,"Dengue (5)",null,"Chikungunya (2)",null,"Zika (3)",null,"Bartonelosis (6)",null,"Fiebre Amarilla (7)",null,"Chagas (8)",null,"Leishmaniosis (09)"]
[null,null,null,"Nº de Movilizaciones","Nº","N° de organizaciones que participan","Nº","N° de organizaciones que participan","Nº","N° de organizaciones que participan","Nº","N° de organizaciones que participan","Nº","N° de organizaciones que participan","Nº","N° de organizaciones que participan","Nº","N° de organizaciones que participan","Nº","N° de organizaciones que participan"]
[null,null,47,"Acciones de movilización 1",{"$f":"GETPIVOTDATA(\"Suma de metax181\",TD!$A$192)","v":0},{"$f":"GETPIVOTDATA(\"Suma de metax182\",TD!$A$192)","v":0},{"$f":"GETPIVOTDATA(\"Suma de metax183\",TD!$A$192)","v":0},{"$f":"GETPIVOTDATA(\"Suma de metax184\",TD!$A$192)","v":0},{"$f":"GETPIVOTDATA(\"Suma de metax185\",TD!$A$192)","v":0},{"$f":"GETPIVOTDATA(\"Suma de metax186\",TD!$A$192)","v":0},{"$f":"GETPIVOTDATA(\"Suma de metax187\",TD!$A$192)","v":0},{"$f":"GETPIVOTDATA(\"Suma de metax188\",TD!$A$192)","v":0},{"$f":"GETPIVOTDATA(\"Suma de metax189\",TD!$A$192)","v":0},{"$f":"GETPIVOTDATA(\"Suma de metax190\",TD!$A$192)","v":0},{"$f":"GETPIVOTDATA(\"Suma de metax191\",TD!$A$192)","v":0},{"$f":"GETPIVOTDATA(\"Suma de metax192\",TD!$A$192)","v":0},{"$f":"GETPIVOTDATA(\"Suma de metax193\",TD!$A$192)","v":0},{"$f":"GETPIVOTDATA(\"Suma de metax194\",TD!$A$192)","v":0},{"$f":"GETPIVOTDATA(\"Suma de metax195\",TD!$A$192)","v":0},{"$f":"GETPIVOTDATA(\"Suma de metax196\",TD!$A$192)","v":0}]
[null,null,48,"Acciones de movilización 2",{"$f":"GETPIVOTDATA(\"Suma de metax197\",TD!$A$192)","v":0},{"$f":"GETPIVOTDATA(\"Suma de metax198\",TD!$A$192)","v":0},{"$f":"GETPIVOTDATA(\"Suma de metax199\",TD!$A$192)","v":0},{"$f":"GETPIVOTDATA(\"Suma de metax200\",TD!$A$192)","v":0},{"$f":"GETPIVOTDATA(\"Suma de metax201\",TD!$A$192)","v":0},{"$f":"GETPIVOTDATA(\"Suma de metax202\",TD!$A$192)","v":0},{"$f":"GETPIVOTDATA(\"Suma de metax203\",TD!$A$192)","v":0},{"$f":"GETPIVOTDATA(\"Suma de metax204\",TD!$A$192)","v":0},{"$f":"GETPIVOTDATA(\"Suma de metax205\",TD!$A$192)","v":0},{"$f":"GETPIVOTDATA(\"Suma de metax206\",TD!$A$192)","v":0},{"$f":"GETPIVOTDATA(\"Suma de metax207\",TD!$A$192)","v":0},{"$f":"GETPIVOTDATA(\"Suma de metax208\",TD!$A$192)","v":0},{"$f":"GETPIVOTDATA(\"Suma de metax209\",TD!$A$192)","v":0},{"$f":"GETPIVOTDATA(\"Suma de metax210\",TD!$A$192)","v":0},{"$f":"GETPIVOTDATA(\"Suma de metax211\",TD!$A$192)","v":0},{"$f":"GETPIVOTDATA(\"Suma de metax212\",TD!$A$192)","v":0}]
[null,null,49,"Acciones de movilización 3",{"$f":"GETPIVOTDATA(\"Suma de metax213\",TD!$A$192)","v":0},{"$f":"GETPIVOTDATA(\"Suma de metax214\",TD!$A$192)","v":0},{"$f":"GETPIVOTDATA(\"Suma de metax215\",TD!$A$192)","v":0},{"$f":"GETPIVOTDATA(\"Suma de metax216\",TD!$A$192)","v":0},{"$f":"GETPIVOTDATA(\"Suma de metax217\",TD!$A$192)","v":0},{"$f":"GETPIVOTDATA(\"Suma de metax218\",TD!$A$192)","v":0},{"$f":"GETPIVOTDATA(\"Suma de metax219\",TD!$A$192)","v":0},{"$f":"GETPIVOTDATA(\"Suma de metax220\",TD!$A$192)","v":0},{"$f":"GETPIVOTDATA(\"Suma de metax221\",TD!$A$192)","v":0},{"$f":"GETPIVOTDATA(\"Suma de metax222\",TD!$A$192)","v":0},{"$f":"GETPIVOTDATA(\"Suma de metax223\",TD!$A$192)","v":0},{"$f":"GETPIVOTDATA(\"Suma de metax224\",TD!$A$192)","v":0},{"$f":"GETPIVOTDATA(\"Suma de metax225\",TD!$A$192)","v":0},{"$f":"GETPIVOTDATA(\"Suma de metax226\",TD!$A$192)","v":0},{"$f":"GETPIVOTDATA(\"Suma de metax227\",TD!$A$192)","v":0},{"$f":"GETPIVOTDATA(\"Suma de metax228\",TD!$A$192)","v":0}]
[null,null,50,"Acciones de movilización 4",{"$f":"GETPIVOTDATA(\"Suma de metax229\",TD!$A$192)","v":0},{"$f":"GETPIVOTDATA(\"Suma de metax230\",TD!$A$192)","v":0},{"$f":"GETPIVOTDATA(\"Suma de metax231\",TD!$A$192)","v":0},{"$f":"GETPIVOTDATA(\"Suma de metax232\",TD!$A$192)","v":0},{"$f":"GETPIVOTDATA(\"Suma de metax233\",TD!$A$192)","v":0},{"$f":"GETPIVOTDATA(\"Suma de metax234\",TD!$A$192)","v":0},{"$f":"GETPIVOTDATA(\"Suma de metax235\",TD!$A$192)","v":0},{"$f":"GETPIVOTDATA(\"Suma de metax236\",TD!$A$192)","v":0},{"$f":"GETPIVOTDATA(\"Suma de metax237\",TD!$A$192)","v":0},{"$f":"GETPIVOTDATA(\"Suma de metax238\",TD!$A$192)","v":0},{"$f":"GETPIVOTDATA(\"Suma de metax239\",TD!$A$192)","v":0},{"$f":"GETPIVOTDATA(\"Suma de metax240\",TD!$A$192)","v":0},{"$f":"GETPIVOTDATA(\"Suma de metax241\",TD!$A$192)","v":0},{"$f":"GETPIVOTDATA(\"Suma de metax242\",TD!$A$192)","v":0},{"$f":"GETPIVOTDATA(\"Suma de metax243\",TD!$A$192)","v":0},{"$f":"GETPIVOTDATA(\"Suma de metax244\",TD!$A$192)","v":0}]
[]
[null,null,null,"Acciones de movilización comunitaria -Ejecución de campaña de recojo y eliminación de inservibles -Vigilancia Sanitaria de la Limpieza de Vías y Espacios Públicos "]
[]
[null,null,null,"Metaxenicas "]
[null,null,null,null,1,2,3,4,5,6,7,8,9,10,11,12,13,14,15,16]
[null,null,null,null,"Malaria (1)",null,"Dengue (5)",null,"Chikungunya (2)",null,"Zika (3)",null,"Bartonelosis (6)",null,"Fiebre Amarilla (7)",null,"Chagas (8)",null,"Leishmaniosis (09)"]
[null,null,null,"Nº de Movilizaciones","Nº","N° de organizaciones que participan","Nº","N° de organizaciones que participan","Nº","N° de organizaciones que participan","Nº","N° de organizaciones que participan","Nº","N° de organizaciones que participan","Nº","N° de organizaciones que participan","Nº","N° de organizaciones que participan","Nº","N° de organizaciones que participan"]
[null,null,51,"Acciones de movilización 1",{"$f":"GETPIVOTDATA(\"Suma de metax181\",TD!$A$192)","v":0},{"$f":"GETPIVOTDATA(\"Suma de metax182\",TD!$A$192)","v":0},{"$f":"GETPIVOTDATA(\"Suma de metax183\",TD!$A$192)","v":0},{"$f":"GETPIVOTDATA(\"Suma de metax184\",TD!$A$192)","v":0},{"$f":"GETPIVOTDATA(\"Suma de metax185\",TD!$A$192)","v":0},{"$f":"GETPIVOTDATA(\"Suma de metax186\",TD!$A$192)","v":0},{"$f":"GETPIVOTDATA(\"Suma de metax187\",TD!$A$192)","v":0},{"$f":"GETPIVOTDATA(\"Suma de metax188\",TD!$A$192)","v":0},{"$f":"GETPIVOTDATA(\"Suma de metax189\",TD!$A$192)","v":0},{"$f":"GETPIVOTDATA(\"Suma de metax190\",TD!$A$192)","v":0},{"$f":"GETPIVOTDATA(\"Suma de metax191\",TD!$A$192)","v":0},{"$f":"GETPIVOTDATA(\"Suma de metax192\",TD!$A$192)","v":0},{"$f":"GETPIVOTDATA(\"Suma de metax193\",TD!$A$192)","v":0},{"$f":"GETPIVOTDATA(\"Suma de metax194\",TD!$A$192)","v":0},{"$f":"GETPIVOTDATA(\"Suma de metax195\",TD!$A$192)","v":0},{"$f":"GETPIVOTDATA(\"Suma de metax196\",TD!$A$192)","v":0}]
[null,null,52,"Acciones de movilización 2",{"$f":"GETPIVOTDATA(\"Suma de metax197\",TD!$A$192)","v":0},{"$f":"GETPIVOTDATA(\"Suma de metax198\",TD!$A$192)","v":0},{"$f":"GETPIVOTDATA(\"Suma de metax199\",TD!$A$192)","v":0},{"$f":"GETPIVOTDATA(\"Suma de metax200\",TD!$A$192)","v":0},{"$f":"GETPIVOTDATA(\"Suma de metax201\",TD!$A$192)","v":0},{"$f":"GETPIVOTDATA(\"Suma de metax202\",TD!$A$192)","v":0},{"$f":"GETPIVOTDATA(\"Suma de metax203\",TD!$A$192)","v":0},{"$f":"GETPIVOTDATA(\"Suma de metax204\",TD!$A$192)","v":0},{"$f":"GETPIVOTDATA(\"Suma de metax205\",TD!$A$192)","v":0},{"$f":"GETPIVOTDATA(\"Suma de metax206\",TD!$A$192)","v":0},{"$f":"GETPIVOTDATA(\"Suma de metax207\",TD!$A$192)","v":0},{"$f":"GETPIVOTDATA(\"Suma de metax208\",TD!$A$192)","v":0},{"$f":"GETPIVOTDATA(\"Suma de metax209\",TD!$A$192)","v":0},{"$f":"GETPIVOTDATA(\"Suma de metax210\",TD!$A$192)","v":0},{"$f":"GETPIVOTDATA(\"Suma de metax211\",TD!$A$192)","v":0},{"$f":"GETPIVOTDATA(\"Suma de metax212\",TD!$A$192)","v":0}]
[null,null,53,"Acciones de movilización 3",{"$f":"GETPIVOTDATA(\"Suma de metax213\",TD!$A$192)","v":0},{"$f":"GETPIVOTDATA(\"Suma de metax214\",TD!$A$192)","v":0},{"$f":"GETPIVOTDATA(\"Suma de metax215\",TD!$A$192)","v":0},{"$f":"GETPIVOTDATA(\"Suma de metax216\",TD!$A$192)","v":0},{"$f":"GETPIVOTDATA(\"Suma de metax217\",TD!$A$192)","v":0},{"$f":"GETPIVOTDATA(\"Suma de metax218\",TD!$A$192)","v":0},{"$f":"GETPIVOTDATA(\"Suma de metax219\",TD!$A$192)","v":0},{"$f":"GETPIVOTDATA(\"Suma de metax220\",TD!$A$192)","v":0},{"$f":"GETPIVOTDATA(\"Suma de metax221\",TD!$A$192)","v":0},{"$f":"GETPIVOTDATA(\"Suma de metax222\",TD!$A$192)","v":0},{"$f":"GETPIVOTDATA(\"Suma de metax223\",TD!$A$192)","v":0},{"$f":"GETPIVOTDATA(\"Suma de metax224\",TD!$A$192)","v":0},{"$f":"GETPIVOTDATA(\"Suma de metax225\",TD!$A$192)","v":0},{"$f":"GETPIVOTDATA(\"Suma de metax226\",TD!$A$192)","v":0},{"$f":"GETPIVOTDATA(\"Suma de metax227\",TD!$A$192)","v":0},{"$f":"GETPIVOTDATA(\"Suma de metax228\",TD!$A$192)","v":0}]
[null,null,54,"Acciones de movilización 4",{"$f":"GETPIVOTDATA(\"Suma de metax229\",TD!$A$192)","v":0},{"$f":"GETPIVOTDATA(\"Suma de metax230\",TD!$A$192)","v":0},{"$f":"GETPIVOTDATA(\"Suma de metax231\",TD!$A$192)","v":0},{"$f":"GETPIVOTDATA(\"Suma de metax232\",TD!$A$192)","v":0},{"$f":"GETPIVOTDATA(\"Suma de metax233\",TD!$A$192)","v":0},{"$f":"GETPIVOTDATA(\"Suma de metax234\",TD!$A$192)","v":0},{"$f":"GETPIVOTDATA(\"Suma de metax235\",TD!$A$192)","v":0},{"$f":"GETPIVOTDATA(\"Suma de metax236\",TD!$A$192)","v":0},{"$f":"GETPIVOTDATA(\"Suma de metax237\",TD!$A$192)","v":0},{"$f":"GETPIVOTDATA(\"Suma de metax238\",TD!$A$192)","v":0},{"$f":"GETPIVOTDATA(\"Suma de metax239\",TD!$A$192)","v":0},{"$f":"GETPIVOTDATA(\"Suma de metax240\",TD!$A$192)","v":0},{"$f":"GETPIVOTDATA(\"Suma de metax241\",TD!$A$192)","v":0},{"$f":"GETPIVOTDATA(\"Suma de metax242\",TD!$A$192)","v":0},{"$f":"GETPIVOTDATA(\"Suma de metax243\",TD!$A$192)","v":0},{"$f":"GETPIVOTDATA(\"Suma de metax244\",TD!$A$192)","v":0}]
[]
[null,null,null,"Acciones de movilización comunitaria -Ejecución de campaña de recojo y eliminación de inservibles "]
[null,null,null,"Zoonoticas"]
[null,null,null,null,1,2,3,4,5,6,7,8,9,10]
[null,null,null,null,"Rabia (4)",null,"Peste (10)",null,"Leptospirosis (11)",null,"Tifus (12)",null,"Equinococosis (13)"]
[null,null,null,"Nº de Movilizaciones","Nº","N° de organizaciones que participan","Nº","N° de organizaciones que participan","Nº","N° de organizaciones que participan","Nº","N° de organizaciones que participan","Nº","N° de organizaciones que participan"]
[null,null,55,"Acciones de movilización 1",{"$f":"GETPIVOTDATA(\"Suma de metax245\",TD!$A$192)","v":0},{"$f":"GETPIVOTDATA(\"Suma de metax246\",TD!$A$192)","v":0},{"$f":"GETPIVOTDATA(\"Suma de metax247\",TD!$A$192)","v":0},{"$f":"GETPIVOTDATA(\"Suma de metax248\",TD!$A$192)","v":0},{"$f":"GETPIVOTDATA(\"Suma de metax249\",TD!$A$192)","v":0},{"$f":"GETPIVOTDATA(\"Suma de metax250\",TD!$A$192)","v":0},{"$f":"GETPIVOTDATA(\"Suma de metax251\",TD!$A$223)","v":0},{"$f":"GETPIVOTDATA(\"Suma de metax252\",TD!$A$223)","v":0},{"$f":"GETPIVOTDATA(\"Suma de metax253\",TD!$A$223)","v":0},{"$f":"GETPIVOTDATA(\"Suma de metax254\",TD!$A$223)","v":0}]
[null,null,56,"Acciones de movilización 2",{"$f":"GETPIVOTDATA(\"Suma de metax255\",TD!$A$223)","v":0},{"$f":"GETPIVOTDATA(\"Suma de metax256\",TD!$A$223)","v":0},{"$f":"GETPIVOTDATA(\"Suma de metax257\",TD!$A$223)","v":0},{"$f":"GETPIVOTDATA(\"Suma de metax258\",TD!$A$223)","v":0},{"$f":"GETPIVOTDATA(\"Suma de metax259\",TD!$A$223)","v":0},{"$f":"GETPIVOTDATA(\"Suma de metax260\",TD!$A$223)","v":0},{"$f":"GETPIVOTDATA(\"Suma de metax261\",TD!$A$223)","v":0},{"$f":"GETPIVOTDATA(\"Suma de metax262\",TD!$A$223)","v":0},{"$f":"GETPIVOTDATA(\"Suma de metax263\",TD!$A$223)","v":0},{"$f":"GETPIVOTDATA(\"Suma de metax264\",TD!$A$223)","v":0}]
[null,null,57,"Acciones de movilización 3",{"$f":"GETPIVOTDATA(\"Suma de metax265\",TD!$A$223)","v":0},{"$f":"GETPIVOTDATA(\"Suma de metax266\",TD!$A$223)","v":0},{"$f":"GETPIVOTDATA(\"Suma de metax267\",TD!$A$223)","v":0},{"$f":"GETPIVOTDATA(\"Suma de metax268\",TD!$A$223)","v":0},{"$f":"GETPIVOTDATA(\"Suma de metax269\",TD!$A$223)","v":0},{"$f":"GETPIVOTDATA(\"Suma de metax270\",TD!$A$223)","v":0},{"$f":"GETPIVOTDATA(\"Suma de metax271\",TD!$A$223)","v":0},{"$f":"GETPIVOTDATA(\"Suma de metax272\",TD!$A$223)","v":0},{"$f":"GETPIVOTDATA(\"Suma de metax273\",TD!$A$223)","v":0},{"$f":"GETPIVOTDATA(\"Suma de metax274\",TD!$A$223)","v":0}]
[null,null,58,"Acciones de movilización 4",{"$f":"GETPIVOTDATA(\"Suma de metax275\",TD!$A$223)","v":0},{"$f":"GETPIVOTDATA(\"Suma de metax276\",TD!$A$223)","v":0},{"$f":"GETPIVOTDATA(\"Suma de metax277\",TD!$A$223)","v":0},{"$f":"GETPIVOTDATA(\"Suma de metax278\",TD!$A$223)","v":0},{"$f":"GETPIVOTDATA(\"Suma de metax279\",TD!$A$223)","v":0},{"$f":"GETPIVOTDATA(\"Suma de metax280\",TD!$A$223)","v":0},{"$f":"GETPIVOTDATA(\"Suma de metax281\",TD!$A$223)","v":0},{"$f":"GETPIVOTDATA(\"Suma de metax282\",TD!$A$223)","v":0},{"$f":"GETPIVOTDATA(\"Suma de metax283\",TD!$A$223)","v":0},{"$f":"GETPIVOTDATA(\"Suma de metax284\",TD!$A$223)","v":0}]
[]
[null,null,null,"Acciones de movilización comunitaria -Ejecución de campaña de recojo y eliminación de inservibles -Vigilancia Sanitaria de la Limpieza de Vías y Espacios Públicos "]
[null,null,null,"Zoonoticas"]
[null,null,null,null,1,2,3,4,5,6,7,8,9,10]
[null,null,null,null,"Rabia (4)",null,"Peste (10)",null,"Leptospirosis (11)",null,"Tifus (12)",null,"Equinococosis (13)"]
[null,null,null,"Nº de Movilizaciones","Nº","N° de organizaciones que participan","Nº","N° de organizaciones que participan","Nº","N° de organizaciones que participan","Nº","N° de organizaciones que participan","Nº","N° de organizaciones que participan"]
[null,null,59,"Acciones de movilización 1",{"$f":"GETPIVOTDATA(\"Suma de metax245\",TD!$A$192)","v":0},{"$f":"GETPIVOTDATA(\"Suma de metax246\",TD!$A$192)","v":0},{"$f":"GETPIVOTDATA(\"Suma de metax247\",TD!$A$192)","v":0},{"$f":"GETPIVOTDATA(\"Suma de metax248\",TD!$A$192)","v":0},{"$f":"GETPIVOTDATA(\"Suma de metax249\",TD!$A$192)","v":0},{"$f":"GETPIVOTDATA(\"Suma de metax250\",TD!$A$192)","v":0},{"$f":"GETPIVOTDATA(\"Suma de metax251\",TD!$A$223)","v":0},{"$f":"GETPIVOTDATA(\"Suma de metax252\",TD!$A$223)","v":0},{"$f":"GETPIVOTDATA(\"Suma de metax253\",TD!$A$223)","v":0},{"$f":"GETPIVOTDATA(\"Suma de metax254\",TD!$A$223)","v":0}]
[null,null,60,"Acciones de movilización 2",{"$f":"GETPIVOTDATA(\"Suma de metax255\",TD!$A$223)","v":0},{"$f":"GETPIVOTDATA(\"Suma de metax256\",TD!$A$223)","v":0},{"$f":"GETPIVOTDATA(\"Suma de metax257\",TD!$A$223)","v":0},{"$f":"GETPIVOTDATA(\"Suma de metax258\",TD!$A$223)","v":0},{"$f":"GETPIVOTDATA(\"Suma de metax259\",TD!$A$223)","v":0},{"$f":"GETPIVOTDATA(\"Suma de metax260\",TD!$A$223)","v":0},{"$f":"GETPIVOTDATA(\"Suma de metax261\",TD!$A$223)","v":0},{"$f":"GETPIVOTDATA(\"Suma de metax262\",TD!$A$223)","v":0},{"$f":"GETPIVOTDATA(\"Suma de metax263\",TD!$A$223)","v":0},{"$f":"GETPIVOTDATA(\"Suma de metax264\",TD!$A$223)","v":0}]
[null,null,61,"Acciones de movilización 3",{"$f":"GETPIVOTDATA(\"Suma de metax265\",TD!$A$223)","v":0},{"$f":"GETPIVOTDATA(\"Suma de metax266\",TD!$A$223)","v":0},{"$f":"GETPIVOTDATA(\"Suma de metax267\",TD!$A$223)","v":0},{"$f":"GETPIVOTDATA(\"Suma de metax268\",TD!$A$223)","v":0},{"$f":"GETPIVOTDATA(\"Suma de metax269\",TD!$A$223)","v":0},{"$f":"GETPIVOTDATA(\"Suma de metax270\",TD!$A$223)","v":0},{"$f":"GETPIVOTDATA(\"Suma de metax271\",TD!$A$223)","v":0},{"$f":"GETPIVOTDATA(\"Suma de metax272\",TD!$A$223)","v":0},{"$f":"GETPIVOTDATA(\"Suma de metax273\",TD!$A$223)","v":0},{"$f":"GETPIVOTDATA(\"Suma de metax274\",TD!$A$223)","v":0}]
[null,null,62,"Acciones de movilización 4",{"$f":"GETPIVOTDATA(\"Suma de metax275\",TD!$A$223)","v":0},{"$f":"GETPIVOTDATA(\"Suma de metax276\",TD!$A$223)","v":0},{"$f":"GETPIVOTDATA(\"Suma de metax277\",TD!$A$223)","v":0},{"$f":"GETPIVOTDATA(\"Suma de metax278\",TD!$A$223)","v":0},{"$f":"GETPIVOTDATA(\"Suma de metax279\",TD!$A$223)","v":0},{"$f":"GETPIVOTDATA(\"Suma de metax280\",TD!$A$223)","v":0},{"$f":"GETPIVOTDATA(\"Suma de metax281\",TD!$A$223)","v":0},{"$f":"GETPIVOTDATA(\"Suma de metax282\",TD!$A$223)","v":0},{"$f":"GETPIVOTDATA(\"Suma de metax283\",TD!$A$223)","v":0},{"$f":"GETPIVOTDATA(\"Suma de metax284\",TD!$A$223)","v":0}]
[]
[null,null,null,"Acompañamiento y evaluación en la VC"]
[]
[null,null,null,"Metaxenicas "]
[null,null,null,null,1,2]
[null,null,null,"Tematica","Nº","N° de participantes"]
[null,null,63,"Malaria (1)",{"$f":"GETPIVOTDATA(\"Suma de metax285\",TD!$A$223)","v":0},{"$f":"GETPIVOTDATA(\"Suma de metax286\",TD!$A$223)","v":0}]
[null,null,64,"Dengue (5)",{"$f":"GETPIVOTDATA(\"Suma de metax287\",TD!$A$223)","v":0},{"$f":"GETPIVOTDATA(\"Suma de metax288\",TD!$A$223)","v":0}]
[null,null,65,"Chikungunya (2)",{"$f":"GETPIVOTDATA(\"Suma de metax289\",TD!$A$223)","v":0},{"$f":"GETPIVOTDATA(\"Suma de metax290\",TD!$A$223)","v":0}]
[null,null,66,"Zika (3)",{"$f":"GETPIVOTDATA(\"Suma de metax291\",TD!$A$223)","v":0},{"$f":"GETPIVOTDATA(\"Suma de metax292\",TD!$A$223)","v":0}]
[null,null,67,"Bartonelosis (6)",{"$f":"GETPIVOTDATA(\"Suma de metax293\",TD!$A$223)","v":0},{"$f":"GETPIVOTDATA(\"Suma de metax294\",TD!$A$223)","v":0}]
[null,null,68,"Fiebre Amarilla (7)",{"$f":"GETPIVOTDATA(\"Suma de metax295\",TD!$A$223)","v":0},{"$f":"GETPIVOTDATA(\"Suma de metax296\",TD!$A$223)","v":0}]
[null,null,69,"Chagas (8)",{"$f":"GETPIVOTDATA(\"Suma de metax297\",TD!$A$223)","v":0},{"$f":"GETPIVOTDATA(\"Suma de metax298\",TD!$A$223)","v":0}]
[null,null,70,"Leishmaniosis (9)",{"$f":"GETPIVOTDATA(\"Suma de metax299\",TD!$A$223)","v":0},{"$f":"GETPIVOTDATA(\"Suma de metax300\",TD!$A$223)","v":0}]
[]
[null,null,null,"Zoonoticas"]
[null,null,null,null,1,2]
[null,null,null,"Tematica","Nº","N° de participantes"]
[null,null,71,"Rabia (4)",{"$f":"GETPIVOTDATA(\"Suma de metax301\",TD!$A$223)","v":0},{"$f":"GETPIVOTDATA(\"Suma de metax302\",TD!$A$223)","v":0}]
[null,null,72,"Peste (10)",{"$f":"GETPIVOTDATA(\"Suma de metax303\",TD!$A$223)","v":0},{"$f":"GETPIVOTDATA(\"Suma de metax304\",TD!$A$223)","v":0}]
[null,null,73,"Leptospirosis (11)",{"$f":"GETPIVOTDATA(\"Suma de metax305\",TD!$A$223)","v":0},{"$f":"GETPIVOTDATA(\"Suma de metax306\",TD!$A$223)","v":0}]
[null,null,74,"Tifus (12)",{"$f":"GETPIVOTDATA(\"Suma de metax307\",TD!$A$223)","v":0},{"$f":"GETPIVOTDATA(\"Suma de metax308\",TD!$A$223)","v":0}]
[null,null,75,"Equinococosis (13)",{"$f":"GETPIVOTDATA(\"Suma de metax309\",TD!$A$223)","v":0},{"$f":"GETPIVOTDATA(\"Suma de metax310\",TD!$A$223)","v":0}]
[]
[null,null,"4. MUNICIPIOS (COMITÉ MULTISECTORIAL) CAPACITADO Y ARTICULADO PARA MEJORAR O MITIGAR LAS CONDICIONES QUE GENERAN RIESGO DE ENFERMAR O MORIR POR ALGUNA ENFERMEDAD METAXENICA O ZOONOTICA"]
[]
[null,null,null,"Metaxenicas "]
[]
[null,null,null,null,1,2,3,4]
[null,null,null,null,"ACCIONES"]
[null,null,null,"Tematica","Integración de información sanitaria (Sala Municipal de Salud)","Incidencia y abogacía al gobierno local","Sectorización y homologación territorial salud – gobierno local","Mapeo de actores sociales (actividades y recursos según actor social)"]
[null,null,76,"Malaria (1)",{"$f":"GETPIVOTDATA(\"Suma de metax313\",TD!$A$223)","v":0},{"$f":"GETPIVOTDATA(\"Suma de metax314\",TD!$A$223)","v":0},{"$f":"GETPIVOTDATA(\"Suma de metax315\",TD!$A$223)","v":0},{"$f":"GETPIVOTDATA(\"Suma de metax316\",TD!$A$223)","v":0}]
[null,null,77,"Dengue (5)",{"$f":"GETPIVOTDATA(\"Suma de metax317\",TD!$A$223)","v":0},{"$f":"GETPIVOTDATA(\"Suma de metax318\",TD!$A$223)","v":0},{"$f":"GETPIVOTDATA(\"Suma de metax319\",TD!$A$223)","v":0},{"$f":"GETPIVOTDATA(\"Suma de metax320\",TD!$A$223)","v":0}]
[null,null,78,"Chikungunya (2)",{"$f":"GETPIVOTDATA(\"Suma de metax321\",TD!$A$223)","v":0},{"$f":"GETPIVOTDATA(\"Suma de metax322\",TD!$A$223)","v":0},{"$f":"GETPIVOTDATA(\"Suma de metax323\",TD!$A$223)","v":0},{"$f":"GETPIVOTDATA(\"Suma de metax324\",TD!$A$223)","v":0}]
[null,null,79,"Zika (3)",{"$f":"GETPIVOTDATA(\"Suma de metax325\",TD!$A$223)","v":0},{"$f":"GETPIVOTDATA(\"Suma de metax326\",TD!$A$223)","v":0},{"$f":"GETPIVOTDATA(\"Suma de metax327\",TD!$A$223)","v":0},{"$f":"GETPIVOTDATA(\"Suma de metax328\",TD!$A$223)","v":0}]
[null,null,80,"Bartonelosis (6)",{"$f":"GETPIVOTDATA(\"Suma de metax329\",TD!$A$223)","v":0},{"$f":"GETPIVOTDATA(\"Suma de metax330\",TD!$A$223)","v":0},{"$f":"GETPIVOTDATA(\"Suma de metax331\",TD!$A$223)","v":0},{"$f":"GETPIVOTDATA(\"Suma de metax332\",TD!$A$223)","v":0}]
[null,null,81,"Fiebre Amarilla (7)",{"$f":"GETPIVOTDATA(\"Suma de metax333\",TD!$A$223)","v":0},{"$f":"GETPIVOTDATA(\"Suma de metax334\",TD!$A$223)","v":0},{"$f":"GETPIVOTDATA(\"Suma de metax335\",TD!$A$223)","v":0},{"$f":"GETPIVOTDATA(\"Suma de metax336\",TD!$A$223)","v":0}]
[null,null,82,"Chagas (8)",{"$f":"GETPIVOTDATA(\"Suma de metax337\",TD!$A$223)","v":0},{"$f":"GETPIVOTDATA(\"Suma de metax338\",TD!$A$223)","v":0},{"$f":"GETPIVOTDATA(\"Suma de metax339\",TD!$A$223)","v":0},{"$f":"GETPIVOTDATA(\"Suma de metax340\",TD!$A$223)","v":0}]
[null,null,83,"Leishmaniosis (9)",{"$f":"GETPIVOTDATA(\"Suma de metax341\",TD!$A$223)","v":0},{"$f":"GETPIVOTDATA(\"Suma de metax342\",TD!$A$223)","v":0},{"$f":"GETPIVOTDATA(\"Suma de metax343\",TD!$A$223)","v":0},{"$f":"GETPIVOTDATA(\"Suma de metax344\",TD!$A$223)","v":0}]
[]
[]
[null,null,null,"Zoonoticas"]
[]
[null,null,null,null,1,2,3,4]
[null,null,null,null,"ACCIONES"]
[null,null,null,"Tematica","Integración de información sanitaria (Sala Municipal de Salud)","Incidencia y abogacía al gobierno local","Sectorización y homologación territorial salud – gobierno local","Mapeo de actores sociales (actividades y recursos según actor social)"]
[null,null,84,"Rabia (4)",{"$f":"GETPIVOTDATA(\"Suma de metax345\",TD!$A$223)","v":0},{"$f":"GETPIVOTDATA(\"Suma de metax346\",TD!$A$223)","v":0},{"$f":"GETPIVOTDATA(\"Suma de metax347\",TD!$A$223)","v":0},{"$f":"GETPIVOTDATA(\"Suma de metax348\",TD!$A$223)","v":0}]
[null,null,85,"Peste (10)",{"$f":"GETPIVOTDATA(\"Suma de metax349\",TD!$A$223)","v":0},{"$f":"GETPIVOTDATA(\"Suma de metax350\",TD!$A$223)","v":0},{"$f":"GETPIVOTDATA(\"Suma de metax351\",TD!$A$223)","v":0},{"$f":"GETPIVOTDATA(\"Suma de metax352\",TD!$A$223)","v":0}]
[null,null,86,"Leptospirosis (11)",{"$f":"GETPIVOTDATA(\"Suma de metax353\",TD!$A$223)","v":0},{"$f":"GETPIVOTDATA(\"Suma de metax354\",TD!$A$223)","v":0},{"$f":"GETPIVOTDATA(\"Suma de metax355\",TD!$A$223)","v":0},{"$f":"GETPIVOTDATA(\"Suma de metax356\",TD!$A$223)","v":0}]
[null,null,87,"Tifus (12)",{"$f":"GETPIVOTDATA(\"Suma de metax357\",TD!$A$223)","v":0},{"$f":"GETPIVOTDATA(\"Suma de metax358\",TD!$A$223)","v":0},{"$f":"GETPIVOTDATA(\"Suma de metax359\",TD!$A$223)","v":0},{"$f":"GETPIVOTDATA(\"Suma de metax360\",TD!$A$223)","v":0}]
[null,null,88,"Equinococosis (13)",{"$f":"GETPIVOTDATA(\"Suma de metax361\",TD!$A$223)","v":0},{"$f":"GETPIVOTDATA(\"Suma de metax362\",TD!$A$223)","v":0},{"$f":"GETPIVOTDATA(\"Suma de metax363\",TD!$A$223)","v":0},{"$f":"GETPIVOTDATA(\"Suma de metax364\",TD!$A$223)","v":0}]
[]
[null,null,null,"Conformación y reuniones del comité multisectorial"]
[]
[null,null,null,"Metaxenicas "]
[null,null,null,null,1]
[null,null,null,"Tematica","Nº"]
[null,null,98,"Malaria (1)",{"$f":"GETPIVOTDATA(\"Suma de metax365\",TD!$A$223)","v":0}]
[null,null,99,"Dengue (5)",{"$f":"GETPIVOTDATA(\"Suma de metax366\",TD!$A$223)","v":0}]
[null,null,100,"Chikungunya (2)",{"$f":"GETPIVOTDATA(\"Suma de metax367\",TD!$A$223)","v":0}]
[null,null,101,"Zika (3)",{"$f":"GETPIVOTDATA(\"Suma de metax368\",TD!$A$223)","v":0}]
[null,null,102,"Bartonelosis (6)",{"$f":"GETPIVOTDATA(\"Suma de metax369\",TD!$A$223)","v":0}]
[null,null,103,"Fiebre Amarilla (7)",{"$f":"GETPIVOTDATA(\"Suma de metax370\",TD!$A$223)","v":0}]
[null,null,104,"Chagas (8)",{"$f":"GETPIVOTDATA(\"Suma de metax371\",TD!$A$223)","v":0}]
[null,null,105,"Leishmaniosis (9)",{"$f":"GETPIVOTDATA(\"Suma de metax372\",TD!$A$223)","v":0}]
[]
[null,null,null,"Zoonoticas"]
[null,null,null,null,1]
[null,null,null,"Tematica","Nº"]
[null,null,106,"Rabia (4)",{"$f":"GETPIVOTDATA(\"Suma de metax373\",TD!$A$223)","v":0}]
[null,null,107,"Peste (10)",{"$f":"GETPIVOTDATA(\"Suma de metax374\",TD!$A$223)","v":0}]
[null,null,108,"Leptospirosis (11)",{"$f":"GETPIVOTDATA(\"Suma de metax375\",TD!$A$223)","v":0}]
[null,null,109,"Tifus (12)",{"$f":"GETPIVOTDATA(\"Suma de metax376\",TD!$A$223)","v":0}]
[null,null,110,"Equinococosis (13)",{"$f":"GETPIVOTDATA(\"Suma de metax377\",TD!$A$223)","v":0}]
[]
[null,null,null,"Asistencia técnica para elaboración del plan multisectorial."]
[null,null,null,"Metaxenicas "]
[]
[null,null,null,null,1,2]
[null,null,null,"Tematica","PLAN (1)","PPR (2)"]
[null,null,111,"Malaria (1)",{"$f":"GETPIVOTDATA(\"Suma de metax378\",TD!$A$223)","v":0},{"$f":"GETPIVOTDATA(\"Suma de metax379\",TD!$A$223)","v":0}]
[null,null,112,"Dengue (5)",{"$f":"GETPIVOTDATA(\"Suma de metax380\",TD!$A$223)","v":0},{"$f":"GETPIVOTDATA(\"Suma de metax381\",TD!$A$223)","v":0}]
[null,null,113,"Chikungunya (2)",{"$f":"GETPIVOTDATA(\"Suma de metax382\",TD!$A$223)","v":0},{"$f":"GETPIVOTDATA(\"Suma de metax383\",TD!$A$223)","v":0}]
[null,null,114,"Zika (3)",{"$f":"GETPIVOTDATA(\"Suma de metax384\",TD!$A$223)","v":0},{"$f":"GETPIVOTDATA(\"Suma de metax385\",TD!$A$223)","v":0}]
[null,null,115,"Bartonelosis (6)",{"$f":"GETPIVOTDATA(\"Suma de metax386\",TD!$A$223)","v":0},{"$f":"GETPIVOTDATA(\"Suma de metax387\",TD!$A$223)","v":0}]
[null,null,116,"Fiebre Amarilla (7)",{"$f":"GETPIVOTDATA(\"Suma de metax388\",TD!$A$223)","v":0},{"$f":"GETPIVOTDATA(\"Suma de metax389\",TD!$A$223)","v":0}]
[null,null,117,"Chagas (8)",{"$f":"GETPIVOTDATA(\"Suma de metax390\",TD!$A$223)","v":0},{"$f":"GETPIVOTDATA(\"Suma de metax391\",TD!$A$223)","v":0}]
[null,null,118,"Leishmaniosis (9)",{"$f":"GETPIVOTDATA(\"Suma de metax392\",TD!$A$223)","v":0},{"$f":"GETPIVOTDATA(\"Suma de metax393\",TD!$A$223)","v":0}]
[]
[null,null,null,"Zoonoticas"]
[]
[null,null,null,null,1,2]
[null,null,null,"Tematica","PLAN (1)","PPR (2)"]
[null,null,119,"Rabia (4)",{"$f":"GETPIVOTDATA(\"Suma de metax394\",TD!$A$223)","v":0},{"$f":"GETPIVOTDATA(\"Suma de metax395\",TD!$A$223)","v":0}]
[null,null,120,"Peste (10)",{"$f":"GETPIVOTDATA(\"Suma de metax396\",TD!$A$223)","v":0},{"$f":"GETPIVOTDATA(\"Suma de metax397\",TD!$A$223)","v":0}]
[null,null,121,"Leptospirosis (11)",{"$f":"GETPIVOTDATA(\"Suma de metax398\",TD!$A$223)","v":0},{"$f":"GETPIVOTDATA(\"Suma de metax399\",TD!$A$223)","v":0}]
[null,null,122,"Tifus (12)",{"$f":"GETPIVOTDATA(\"Suma de metax400\",TD!$A$223)","v":0},{"$f":"GETPIVOTDATA(\"Suma de metax401\",TD!$A$223)","v":0}]
[null,null,123,"Equinococosis (13)",{"$f":"GETPIVOTDATA(\"Suma de metax402\",TD!$A$223)","v":0},{"$f":"GETPIVOTDATA(\"Suma de metax403\",TD!$A$223)","v":0}]
[]
[]
[]
[null,null,null,"Monitoreo"]
[]
[null,null,null,"Metaxenicas "]
[null,null,null,null,1]
[null,null,null,"Tematica","Nº"]
[null,null,124,"Malaria (1)",{"$f":"GETPIVOTDATA(\"Suma de metax405\",TD!$A$223)","v":0}]
[null,null,125,"Dengue (5)",{"$f":"GETPIVOTDATA(\"Suma de metax406\",TD!$A$223)","v":0}]
[null,null,126,"Chikungunya (2)",{"$f":"GETPIVOTDATA(\"Suma de metax407\",TD!$A$223)","v":0}]
[null,null,127,"Zika (3)",{"$f":"GETPIVOTDATA(\"Suma de metax408\",TD!$A$223)","v":0}]
[null,null,128,"Bartonelosis (6)",{"$f":"GETPIVOTDATA(\"Suma de metax409\",TD!$A$223)","v":0}]
[null,null,129,"Fiebre Amarilla (7)",{"$f":"GETPIVOTDATA(\"Suma de metax410\",TD!$A$223)","v":0}]
[null,null,130,"Chagas (8)",{"$f":"GETPIVOTDATA(\"Suma de metax411\",TD!$A$223)","v":0}]
[null,null,131,"Leishmaniosis (9)",{"$f":"GETPIVOTDATA(\"Suma de metax412\",TD!$A$223)","v":0}]
[]
[]
[null,null,null,"Zoonoticas"]
[null,null,null,null,1]
[null,null,null,"Tematica","Nº"]
[null,null,132,"Rabia (4)",{"$f":"GETPIVOTDATA(\"Suma de metax413\",TD!$A$223)","v":0}]
[null,null,133,"Peste (10)",{"$f":"GETPIVOTDATA(\"Suma de metax414\",TD!$A$223)","v":0}]
[null,null,134,"Leptospirosis (11)",{"$f":"GETPIVOTDATA(\"Suma de metax415\",TD!$A$223)","v":0}]
[null,null,135,"Tifus (12)",{"$f":"GETPIVOTDATA(\"Suma de metax416\",TD!$A$223)","v":0}]
[null,null,136,"Equinococosis (13)",{"$f":"GETPIVOTDATA(\"Suma de metax417\",TD!$A$223)","v":0}]
[]
[null,null,null,"Evaluación"]
[]
[null,null,null,"Metaxenicas "]
[null,null,null,null,1]
[null,null,null,"Tematica","Nº"]
[null,null,137,"Malaria (1)",{"$f":"GETPIVOTDATA(\"Suma de metax418\",TD!$A$223)","v":0}]
[null,null,138,"Dengue (5)",{"$f":"GETPIVOTDATA(\"Suma de metax419\",TD!$A$223)","v":0}]
[null,null,139,"Chikungunya (2)",{"$f":"GETPIVOTDATA(\"Suma de metax420\",TD!$A$223)","v":0}]
[null,null,140,"Zika (3)",{"$f":"GETPIVOTDATA(\"Suma de metax421\",TD!$A$223)","v":0}]
[null,null,141,"Bartonelosis (6)",{"$f":"GETPIVOTDATA(\"Suma de metax422\",TD!$A$223)","v":0}]
[null,null,142,"Fiebre Amarilla (7)",{"$f":"GETPIVOTDATA(\"Suma de metax423\",TD!$A$223)","v":0}]
[null,null,143,"Chagas (8)",{"$f":"GETPIVOTDATA(\"Suma de metax424\",TD!$A$223)","v":0}]
[null,null,144,"Leishmaniosis (9)",{"$f":"GETPIVOTDATA(\"Suma de metax425\",TD!$A$223)","v":0}]
[]
[null,null,null,"Zoonoticas"]
[null,null,null,null,1]
[null,null,null,"Tematica","Nº"]
[null,null,145,"Rabia (4)",{"$f":"GETPIVOTDATA(\"Suma de metax426\",TD!$A$223)","v":0}]
[null,null,146,"Peste (10)",{"$f":"GETPIVOTDATA(\"Suma de metax427\",TD!$A$223)","v":0}]
[null,null,147,"Leptospirosis (11)",{"$f":"GETPIVOTDATA(\"Suma de metax428\",TD!$A$223)","v":0}]
[null,null,148,"Tifus (12)",{"$f":"GETPIVOTDATA(\"Suma de metax429\",TD!$A$223)","v":0}]
[null,null,149,"Equinococosis (13)",{"$f":"GETPIVOTDATA(\"Suma de metax430\",TD!$A$223)","v":0}]
[]
[null,null,null,"trazador","Metaxenicas",{"$f":"E294","v":0}]
[null,null,null,null,"Zoonosis",{"$f":"E305","v":0}]
[null,null,null,"TOTAL",null,{"$f":"F311+F312","v":0}]
[]
[null,null,"5. DOCENTES, DIRECTIVOS Y PADRES DE FAMILIA, CAPACITADOS Y COMPROMETIDOS A DESARROLLAR ACCIONES PARA LA PROMOCIÓN DE PRÁCTICAS SALUDABLES PARA LA PREVENCIÓN DE LAS ENFERMEDADES METAXÉNICA Y ZOONÓTICAS"]
[null,null,null,"Taller para Instituciones Educativas Metaxenicas"]
[]
[null,null,null,"Metaxenicas "]
[null,null,null,null,1,2,3,4,5,6,7,8]
[null,null,null,null,"NIVEL INICIAL",null,"NIVEL PRIMARIO",null,"NIVEL SECUNDARIO",null,"NIVEL ESPECIAL"]
[null,null,null,"Tematica","Reunion","Participantes","Reunion","Participantes","Reunion","Participantes","Reunion","Participantes"]
[null,null,150,"Malaria (1)",{"$f":"GETPIVOTDATA(\"Suma de metax431\",TD!$A$223)","v":0},{"$f":"GETPIVOTDATA(\"Suma de metax432\",TD!$A$223)","v":0},{"$f":"GETPIVOTDATA(\"Suma de metax433\",TD!$A$223)","v":0},{"$f":"GETPIVOTDATA(\"Suma de metax434\",TD!$A$223)","v":0},{"$f":"GETPIVOTDATA(\"Suma de metax435\",TD!$A$223)","v":0},{"$f":"GETPIVOTDATA(\"Suma de metax436\",TD!$A$223)","v":0},{"$f":"GETPIVOTDATA(\"Suma de metax437\",TD!$A$223)","v":0},{"$f":"GETPIVOTDATA(\"Suma de metax438\",TD!$A$223)","v":0}]
[null,null,151,"Dengue (5)",{"$f":"GETPIVOTDATA(\"Suma de metax439\",TD!$A$223)","v":0},{"$f":"GETPIVOTDATA(\"Suma de metax440\",TD!$A$223)","v":0},{"$f":"GETPIVOTDATA(\"Suma de metax441\",TD!$A$223)","v":0},{"$f":"GETPIVOTDATA(\"Suma de metax442\",TD!$A$223)","v":0},{"$f":"GETPIVOTDATA(\"Suma de metax443\",TD!$A$223)","v":0},{"$f":"GETPIVOTDATA(\"Suma de metax444\",TD!$A$223)","v":0},{"$f":"GETPIVOTDATA(\"Suma de metax445\",TD!$A$223)","v":0},{"$f":"GETPIVOTDATA(\"Suma de metax446\",TD!$A$223)","v":0}]
[null,null,152,"Chikungunya (2)",{"$f":"GETPIVOTDATA(\"Suma de metax447\",TD!$A$223)","v":0},{"$f":"GETPIVOTDATA(\"Suma de metax448\",TD!$A$223)","v":0},{"$f":"GETPIVOTDATA(\"Suma de metax449\",TD!$A$223)","v":0},{"$f":"GETPIVOTDATA(\"Suma de metax450\",TD!$A$223)","v":0},{"$f":"GETPIVOTDATA(\"Suma de metax451\",TD!$A$223)","v":0},{"$f":"GETPIVOTDATA(\"Suma de metax452\",TD!$A$223)","v":0},{"$f":"GETPIVOTDATA(\"Suma de metax453\",TD!$A$223)","v":0},{"$f":"GETPIVOTDATA(\"Suma de metax454\",TD!$A$223)","v":0}]
[null,null,153,"Zika (3)",{"$f":"GETPIVOTDATA(\"Suma de metax455\",TD!$A$223)","v":0},{"$f":"GETPIVOTDATA(\"Suma de metax456\",TD!$A$223)","v":0},{"$f":"GETPIVOTDATA(\"Suma de metax457\",TD!$A$223)","v":0},{"$f":"GETPIVOTDATA(\"Suma de metax458\",TD!$A$223)","v":0},{"$f":"GETPIVOTDATA(\"Suma de metax459\",TD!$A$223)","v":0},{"$f":"GETPIVOTDATA(\"Suma de metax460\",TD!$A$223)","v":0},{"$f":"GETPIVOTDATA(\"Suma de metax461\",TD!$A$223)","v":0},{"$f":"GETPIVOTDATA(\"Suma de metax462\",TD!$A$223)","v":0}]
[null,null,154,"Bartonelosis (6)",{"$f":"GETPIVOTDATA(\"Suma de metax463\",TD!$A$223)","v":0},{"$f":"GETPIVOTDATA(\"Suma de metax464\",TD!$A$223)","v":0},{"$f":"GETPIVOTDATA(\"Suma de metax465\",TD!$A$223)","v":0},{"$f":"GETPIVOTDATA(\"Suma de metax466\",TD!$A$223)","v":0},{"$f":"GETPIVOTDATA(\"Suma de metax467\",TD!$A$223)","v":0},{"$f":"GETPIVOTDATA(\"Suma de metax468\",TD!$A$223)","v":0},{"$f":"GETPIVOTDATA(\"Suma de metax469\",TD!$A$223)","v":0},{"$f":"GETPIVOTDATA(\"Suma de metax470\",TD!$A$223)","v":0}]
[null,null,155,"Fiebre Amarilla (7)",{"$f":"GETPIVOTDATA(\"Suma de metax471\",TD!$A$223)","v":0},{"$f":"GETPIVOTDATA(\"Suma de metax472\",TD!$A$223)","v":0},{"$f":"GETPIVOTDATA(\"Suma de metax473\",TD!$A$223)","v":0},{"$f":"GETPIVOTDATA(\"Suma de metax474\",TD!$A$223)","v":0},{"$f":"GETPIVOTDATA(\"Suma de metax475\",TD!$A$223)","v":0},{"$f":"GETPIVOTDATA(\"Suma de metax476\",TD!$A$223)","v":0},{"$f":"GETPIVOTDATA(\"Suma de metax477\",TD!$A$223)","v":0},{"$f":"GETPIVOTDATA(\"Suma de metax478\",TD!$A$223)","v":0}]
[null,null,156,"Chagas (8)",{"$f":"GETPIVOTDATA(\"Suma de metax479\",TD!$A$223)","v":0},{"$f":"GETPIVOTDATA(\"Suma de metax480\",TD!$A$223)","v":0},{"$f":"GETPIVOTDATA(\"Suma de metax481\",TD!$A$223)","v":0},{"$f":"GETPIVOTDATA(\"Suma de metax482\",TD!$A$223)","v":0},{"$f":"GETPIVOTDATA(\"Suma de metax483\",TD!$A$223)","v":0},{"$f":"GETPIVOTDATA(\"Suma de metax484\",TD!$A$223)","v":0},{"$f":"GETPIVOTDATA(\"Suma de metax485\",TD!$A$223)","v":0},{"$f":"GETPIVOTDATA(\"Suma de metax486\",TD!$A$223)","v":0}]
[null,null,157,"Leishmaniosis (9)",{"$f":"GETPIVOTDATA(\"Suma de metax487\",TD!$A$223)","v":0},{"$f":"GETPIVOTDATA(\"Suma de metax488\",TD!$A$223)","v":0},{"$f":"GETPIVOTDATA(\"Suma de metax489\",TD!$A$223)","v":0},{"$f":"GETPIVOTDATA(\"Suma de metax490\",TD!$A$223)","v":0},{"$f":"GETPIVOTDATA(\"Suma de metax491\",TD!$A$223)","v":0},{"$f":"GETPIVOTDATA(\"Suma de metax492\",TD!$A$223)","v":0},{"$f":"GETPIVOTDATA(\"Suma de metax493\",TD!$A$223)","v":0},{"$f":"GETPIVOTDATA(\"Suma de metax494\",TD!$A$223)","v":0}]
[]
[null,null,null,"Zoonoticas"]
[null,null,null,null,1,2,3,4,5,6,7,8]
[null,null,null,null,"NIVEL INICIAL",null,"NIVEL PRIMARIO",null,"NIVEL SECUNDARIO",null,"NIVEL ESPECIAL"]
[null,null,null,"Tematica","Reunion","Participantes","Reunion","Participantes","Reunion","Participantes","Reunion","Participantes"]
[null,null,158,"Rabia (4)",{"$f":"GETPIVOTDATA(\"Suma de metax495\",TD!$A$223)","v":0},{"$f":"GETPIVOTDATA(\"Suma de metax496\",TD!$A$223)","v":0},{"$f":"GETPIVOTDATA(\"Suma de metax497\",TD!$A$223)","v":2},{"$f":"GETPIVOTDATA(\"Suma de metax498\",TD!$A$223)","v":21},{"$f":"GETPIVOTDATA(\"Suma de metax499\",TD!$A$223)","v":1},{"$f":"GETPIVOTDATA(\"Suma de metax500\",TD!$A$223)","v":22},{"$f":"GETPIVOTDATA(\"Suma de metax501\",TD!$A$256)","v":0},{"$f":"GETPIVOTDATA(\"Suma de metax502\",TD!$A$256)","v":0}]
[null,null,159,"Peste (10)",{"$f":"GETPIVOTDATA(\"Suma de metax503\",TD!$A$256)","v":0},{"$f":"GETPIVOTDATA(\"Suma de metax504\",TD!$A$256)","v":0},{"$f":"GETPIVOTDATA(\"Suma de metax505\",TD!$A$256)","v":0},{"$f":"GETPIVOTDATA(\"Suma de metax506\",TD!$A$256)","v":0},{"$f":"GETPIVOTDATA(\"Suma de metax507\",TD!$A$256)","v":0},{"$f":"GETPIVOTDATA(\"Suma de metax508\",TD!$A$256)","v":0},{"$f":"GETPIVOTDATA(\"Suma de metax509\",TD!$A$256)","v":0},{"$f":"GETPIVOTDATA(\"Suma de metax510\",TD!$A$256)","v":0}]
[null,null,160,"Leptospirosis (11)",{"$f":"GETPIVOTDATA(\"Suma de metax511\",TD!$A$256)","v":0},{"$f":"GETPIVOTDATA(\"Suma de metax512\",TD!$A$256)","v":0},{"$f":"GETPIVOTDATA(\"Suma de metax513\",TD!$A$256)","v":0},{"$f":"GETPIVOTDATA(\"Suma de metax514\",TD!$A$256)","v":0},{"$f":"GETPIVOTDATA(\"Suma de metax515\",TD!$A$256)","v":0},{"$f":"GETPIVOTDATA(\"Suma de metax516\",TD!$A$256)","v":0},{"$f":"GETPIVOTDATA(\"Suma de metax517\",TD!$A$256)","v":0},{"$f":"GETPIVOTDATA(\"Suma de metax518\",TD!$A$256)","v":0}]
[null,null,161,"Tifus (12)",{"$f":"GETPIVOTDATA(\"Suma de metax519\",TD!$A$256)","v":0},{"$f":"GETPIVOTDATA(\"Suma de metax520\",TD!$A$256)","v":0},{"$f":"GETPIVOTDATA(\"Suma de metax521\",TD!$A$256)","v":0},{"$f":"GETPIVOTDATA(\"Suma de metax522\",TD!$A$256)","v":0},{"$f":"GETPIVOTDATA(\"Suma de metax523\",TD!$A$256)","v":0},{"$f":"GETPIVOTDATA(\"Suma de metax524\",TD!$A$256)","v":0},{"$f":"GETPIVOTDATA(\"Suma de metax525\",TD!$A$256)","v":0},{"$f":"GETPIVOTDATA(\"Suma de metax526\",TD!$A$256)","v":0}]
[null,null,162,"Equinococosis (13)",{"$f":"GETPIVOTDATA(\"Suma de metax527\",TD!$A$256)","v":0},{"$f":"GETPIVOTDATA(\"Suma de metax528\",TD!$A$256)","v":0},{"$f":"GETPIVOTDATA(\"Suma de metax529\",TD!$A$256)","v":0},{"$f":"GETPIVOTDATA(\"Suma de metax530\",TD!$A$256)","v":0},{"$f":"GETPIVOTDATA(\"Suma de metax531\",TD!$A$256)","v":1},{"$f":"GETPIVOTDATA(\"Suma de metax532\",TD!$A$256)","v":17},{"$f":"GETPIVOTDATA(\"Suma de metax533\",TD!$A$256)","v":0},{"$f":"GETPIVOTDATA(\"Suma de metax534\",TD!$A$256)","v":0}]
[]
[null,null,null,"trazador",{"$f":"F323+H323+J323+F335+H335+J335","v":43}]
[]
[]
[null,null,null,"Cuando el docente capacitado desarrolla el proyecto/sesión de aprendizaje relacionados a la prevención de las enfermedades Metaxénica y Zoonóticas se registrará:"]
[]
[null,null,null,"Metaxenicas "]
[null,null,null,null,1,2,3,4,5,6,7,8]
[null,null,null,"DIAGNOSTICO_METAX_(2)","DENGUE (5)",null,"CHIKUNGUNYA (2)",null,"ZIKA (3)",null,"LEISHMANIASIS (9)"]
[null,null,null,"VISITA","Nº","N° de participantes","Nº","N° de participantes","Nº","N° de participantes","Nº","N° de participantes"]
[null,null,163,"Visita de evaluación 1",{"$f":"GETPIVOTDATA(\"Suma de metax536\",TD!$A$256)","v":0},{"$f":"GETPIVOTDATA(\"Suma de metax537\",TD!$A$256)","v":0},{"$f":"GETPIVOTDATA(\"Suma de metax538\",TD!$A$256)","v":0},{"$f":"GETPIVOTDATA(\"Suma de metax539\",TD!$A$256)","v":0},{"$f":"GETPIVOTDATA(\"Suma de metax540\",TD!$A$256)","v":0},{"$f":"GETPIVOTDATA(\"Suma de metax541\",TD!$A$256)","v":0},{"$f":"GETPIVOTDATA(\"Suma de metax542\",TD!$A$256)","v":0},{"$f":"GETPIVOTDATA(\"Suma de metax543\",TD!$A$256)","v":0}]
[]
[]
[null,null,null,"Zoonoticas"]
[null,null,null,null,1,2,3,4,5,6,7,8,9,10]
[null,null,null,"DIAGNOSTICO_ZOO_(2)","RABIA",null,"PESTE",null,"LEPTOSPIROSIS",null,"TIFUS",null,"EQUIMOCOCOSIS"]
[null,null,null,"VISITA","Nº","N° de participantes","Nº","N° de participantes","Nº","N° de participantes","Nº","N° de participantes","Nº","N° de participantes"]
[null,null,164,"Visita de evaluación 1",{"$f":"GETPIVOTDATA(\"Suma de metax544\",TD!$A$256)","v":0},{"$f":"GETPIVOTDATA(\"Suma de metax545\",TD!$A$256)","v":0},{"$f":"GETPIVOTDATA(\"Suma de metax546\",TD!$A$256)","v":0},{"$f":"GETPIVOTDATA(\"Suma de metax547\",TD!$A$256)","v":0},{"$f":"GETPIVOTDATA(\"Suma de metax548\",TD!$A$256)","v":0},{"$f":"GETPIVOTDATA(\"Suma de metax549\",TD!$A$256)","v":0},{"$f":"GETPIVOTDATA(\"Suma de metax550\",TD!$A$256)","v":0},{"$f":"GETPIVOTDATA(\"Suma de metax551\",TD!$A$256)","v":0},{"$f":"GETPIVOTDATA(\"Suma de metax552\",TD!$A$256)","v":0},{"$f":"GETPIVOTDATA(\"Suma de metax553\",TD!$A$256)","v":0}]
[]
[null,null,null,"Concurso Interescolar para la prevención de las Enfermedades Metaxénicas"]
[]
[null,null,null,null,1,2,3,4,5,6]
[null,null,null,null,"1º concurso",null,null,"2º concurso"]
[null,null,null,"Tematica","Nº","Nº de II.EE ","Nº de toneladas","Nº","Nº de II.EE ","Nº de toneladas"]
[null,null,165,"Dengue (5)",{"$f":"GETPIVOTDATA(\"Suma de metax554\",TD!$A$256)","v":0},{"$f":"GETPIVOTDATA(\"Suma de metax555\",TD!$A$256)","v":0},{"$f":"GETPIVOTDATA(\"Suma de metax556\",TD!$A$256)","v":0},{"$f":"GETPIVOTDATA(\"Suma de metax557\",TD!$A$256)","v":0},{"$f":"GETPIVOTDATA(\"Suma de metax558\",TD!$A$256)","v":0},{"$f":"GETPIVOTDATA(\"Suma de metax559\",TD!$A$256)","v":0}]
[null,null,166,"Chikungunya (2)",{"$f":"GETPIVOTDATA(\"Suma de metax560\",TD!$A$256)","v":0},{"$f":"GETPIVOTDATA(\"Suma de metax561\",TD!$A$256)","v":0},{"$f":"GETPIVOTDATA(\"Suma de metax562\",TD!$A$256)","v":0},{"$f":"GETPIVOTDATA(\"Suma de metax563\",TD!$A$256)","v":0},{"$f":"GETPIVOTDATA(\"Suma de metax564\",TD!$A$256)","v":0},{"$f":"GETPIVOTDATA(\"Suma de metax565\",TD!$A$256)","v":0}]
[null,null,167,"Zika (3)",{"$f":"GETPIVOTDATA(\"Suma de metax566\",TD!$A$256)","v":0},{"$f":"GETPIVOTDATA(\"Suma de metax567\",TD!$A$256)","v":0},{"$f":"GETPIVOTDATA(\"Suma de metax568\",TD!$A$256)","v":0},{"$f":"GETPIVOTDATA(\"Suma de metax569\",TD!$A$256)","v":0},{"$f":"GETPIVOTDATA(\"Suma de metax570\",TD!$A$256)","v":0},{"$f":"GETPIVOTDATA(\"Suma de metax571\",TD!$A$256)","v":0}]
[]
[null,null,null,"Incidencia a Directivos y Docentes"]
[null,null,null,"Metaxenicas "]
[null,null,null,null,1,2,3,4,5,6]
[null,null,null,"Tematica","NIVEL INICIAL",null,"NIVEL PRIMARIO",null,"NIVEL SECUNDARIA"]
[null,null,null,null,"Nº","N° de participantes","Nº","N° de participantes","Nº","N° de participantes"]
[null,null,168,"Malaria (1)",{"$f":"GETPIVOTDATA(\"Suma de metax572\",TD!$A$256)","v":0},{"$f":"GETPIVOTDATA(\"Suma de metax573\",TD!$A$256)","v":0},{"$f":"GETPIVOTDATA(\"Suma de metax574\",TD!$A$256)","v":0},{"$f":"GETPIVOTDATA(\"Suma de metax575\",TD!$A$256)","v":0},{"$f":"GETPIVOTDATA(\"Suma de metax576\",TD!$A$256)","v":0},{"$f":"GETPIVOTDATA(\"Suma de metax577\",TD!$A$256)","v":0}]
[null,null,169,"Dengue (5)",{"$f":"GETPIVOTDATA(\"Suma de metax578\",TD!$A$256)","v":0},{"$f":"GETPIVOTDATA(\"Suma de metax579\",TD!$A$256)","v":0},{"$f":"GETPIVOTDATA(\"Suma de metax580\",TD!$A$256)","v":0},{"$f":"GETPIVOTDATA(\"Suma de metax581\",TD!$A$256)","v":0},{"$f":"GETPIVOTDATA(\"Suma de metax582\",TD!$A$256)","v":0},{"$f":"GETPIVOTDATA(\"Suma de metax583\",TD!$A$256)","v":0}]
[null,null,170,"Chikungunya (2)",{"$f":"GETPIVOTDATA(\"Suma de metax584\",TD!$A$256)","v":0},{"$f":"GETPIVOTDATA(\"Suma de metax585\",TD!$A$256)","v":0},{"$f":"GETPIVOTDATA(\"Suma de metax586\",TD!$A$256)","v":0},{"$f":"GETPIVOTDATA(\"Suma de metax587\",TD!$A$256)","v":0},{"$f":"GETPIVOTDATA(\"Suma de metax588\",TD!$A$256)","v":0},{"$f":"GETPIVOTDATA(\"Suma de metax589\",TD!$A$256)","v":0}]
[null,null,171,"Zika (3)",{"$f":"GETPIVOTDATA(\"Suma de metax590\",TD!$A$256)","v":0},{"$f":"GETPIVOTDATA(\"Suma de metax591\",TD!$A$256)","v":0},{"$f":"GETPIVOTDATA(\"Suma de metax592\",TD!$A$256)","v":0},{"$f":"GETPIVOTDATA(\"Suma de metax593\",TD!$A$256)","v":0},{"$f":"GETPIVOTDATA(\"Suma de metax594\",TD!$A$256)","v":0},{"$f":"GETPIVOTDATA(\"Suma de metax595\",TD!$A$256)","v":0}]
[null,null,172,"Bartonelosis (6)",{"$f":"GETPIVOTDATA(\"Suma de metax596\",TD!$A$256)","v":0},{"$f":"GETPIVOTDATA(\"Suma de metax597\",TD!$A$256)","v":0},{"$f":"GETPIVOTDATA(\"Suma de metax598\",TD!$A$256)","v":0},{"$f":"GETPIVOTDATA(\"Suma de metax599\",TD!$A$256)","v":0},{"$f":"GETPIVOTDATA(\"Suma de metax600\",TD!$A$256)","v":0},{"$f":"GETPIVOTDATA(\"Suma de metax601\",TD!$A$256)","v":0}]
[null,null,173,"Fiebre Amarilla (7)",{"$f":"GETPIVOTDATA(\"Suma de metax602\",TD!$A$256)","v":0},{"$f":"GETPIVOTDATA(\"Suma de metax603\",TD!$A$256)","v":0},{"$f":"GETPIVOTDATA(\"Suma de metax604\",TD!$A$256)","v":0},{"$f":"GETPIVOTDATA(\"Suma de metax605\",TD!$A$256)","v":0},{"$f":"GETPIVOTDATA(\"Suma de metax606\",TD!$A$256)","v":0},{"$f":"GETPIVOTDATA(\"Suma de metax607\",TD!$A$256)","v":0}]
[null,null,174,"Chagas (8)",{"$f":"GETPIVOTDATA(\"Suma de metax608\",TD!$A$256)","v":0},{"$f":"GETPIVOTDATA(\"Suma de metax609\",TD!$A$256)","v":0},{"$f":"GETPIVOTDATA(\"Suma de metax610\",TD!$A$256)","v":0},{"$f":"GETPIVOTDATA(\"Suma de metax611\",TD!$A$256)","v":0},{"$f":"GETPIVOTDATA(\"Suma de metax612\",TD!$A$256)","v":0},{"$f":"GETPIVOTDATA(\"Suma de metax613\",TD!$A$256)","v":0}]
[null,null,175,"Leishmaniosis (9)",{"$f":"GETPIVOTDATA(\"Suma de metax614\",TD!$A$256)","v":0},{"$f":"GETPIVOTDATA(\"Suma de metax615\",TD!$A$256)","v":0},{"$f":"GETPIVOTDATA(\"Suma de metax616\",TD!$A$256)","v":0},{"$f":"GETPIVOTDATA(\"Suma de metax617\",TD!$A$256)","v":0},{"$f":"GETPIVOTDATA(\"Suma de metax618\",TD!$A$256)","v":0},{"$f":"GETPIVOTDATA(\"Suma de metax619\",TD!$A$256)","v":0}]
[]
[null,null,null,"Zoonoticas"]
[null,null,null,null,1,2,3,4,5,6]
[null,null,null,"Tematica","NIVEL INICIAL",null,"NIVEL PRIMARIO",null,"NIVEL SECUNDARIA"]
[null,null,null,null,"Nº","N° de participantes","Nº","N° de participantes","Nº","N° de participantes"]
[null,null,178,"Rabia (4)",{"$f":"GETPIVOTDATA(\"Suma de metax620\",TD!$A$256)","v":0},{"$f":"GETPIVOTDATA(\"Suma de metax621\",TD!$A$256)","v":0},{"$f":"GETPIVOTDATA(\"Suma de metax622\",TD!$A$256)","v":0},{"$f":"GETPIVOTDATA(\"Suma de metax623\",TD!$A$256)","v":0},{"$f":"GETPIVOTDATA(\"Suma de metax624\",TD!$A$256)","v":0},{"$f":"GETPIVOTDATA(\"Suma de metax625\",TD!$A$256)","v":0}]
[null,null,179,"Peste (10)",{"$f":"GETPIVOTDATA(\"Suma de metax626\",TD!$A$256)","v":0},{"$f":"GETPIVOTDATA(\"Suma de metax627\",TD!$A$256)","v":0},{"$f":"GETPIVOTDATA(\"Suma de metax628\",TD!$A$256)","v":0},{"$f":"GETPIVOTDATA(\"Suma de metax629\",TD!$A$256)","v":0},{"$f":"GETPIVOTDATA(\"Suma de metax630\",TD!$A$256)","v":0},{"$f":"GETPIVOTDATA(\"Suma de metax631\",TD!$A$256)","v":0}]
[null,null,180,"Leptospirosis (11)",{"$f":"GETPIVOTDATA(\"Suma de metax632\",TD!$A$256)","v":0},{"$f":"GETPIVOTDATA(\"Suma de metax633\",TD!$A$256)","v":0},{"$f":"GETPIVOTDATA(\"Suma de metax634\",TD!$A$256)","v":0},{"$f":"GETPIVOTDATA(\"Suma de metax635\",TD!$A$256)","v":0},{"$f":"GETPIVOTDATA(\"Suma de metax636\",TD!$A$256)","v":0},{"$f":"GETPIVOTDATA(\"Suma de metax637\",TD!$A$256)","v":0}]
[null,null,181,"Tifus (12)",{"$f":"GETPIVOTDATA(\"Suma de metax638\",TD!$A$256)","v":0},{"$f":"GETPIVOTDATA(\"Suma de metax639\",TD!$A$256)","v":0},{"$f":"GETPIVOTDATA(\"Suma de metax640\",TD!$A$256)","v":0},{"$f":"GETPIVOTDATA(\"Suma de metax641\",TD!$A$256)","v":0},{"$f":"GETPIVOTDATA(\"Suma de metax642\",TD!$A$256)","v":0},{"$f":"GETPIVOTDATA(\"Suma de metax643\",TD!$A$256)","v":0}]
[null,null,182,"Equinococosis (13)",{"$f":"GETPIVOTDATA(\"Suma de metax644\",TD!$A$256)","v":0},{"$f":"GETPIVOTDATA(\"Suma de metax645\",TD!$A$256)","v":0},{"$f":"GETPIVOTDATA(\"Suma de metax646\",TD!$A$256)","v":0},{"$f":"GETPIVOTDATA(\"Suma de metax647\",TD!$A$256)","v":0},{"$f":"GETPIVOTDATA(\"Suma de metax648\",TD!$A$256)","v":0},{"$f":"GETPIVOTDATA(\"Suma de metax649\",TD!$A$256)","v":0}]
[]
[null,null,null,"Acompañamiento al directivo"]
[null,null,null,"Metaxenicas "]
[null,null,null,null,1,2,3,4,5,6]
[null,null,null,"Tematica","NIVEL INICIAL",null,"NIVEL PRIMARIO",null,"NIVEL SECUNDARIA"]
[null,null,null,null,"Nº","N° de participantes","Nº","N° de participantes","Nº","N° de participantes"]
[null,null,168,"Malaria (1)",{"$f":"GETPIVOTDATA(\"Suma de metax650\",TD!$A$256)","v":0},{"$f":"GETPIVOTDATA(\"Suma de metax651\",TD!$A$256)","v":0},{"$f":"GETPIVOTDATA(\"Suma de metax652\",TD!$A$256)","v":0},{"$f":"GETPIVOTDATA(\"Suma de metax653\",TD!$A$256)","v":0},{"$f":"GETPIVOTDATA(\"Suma de metax654\",TD!$A$256)","v":0},{"$f":"GETPIVOTDATA(\"Suma de metax655\",TD!$A$256)","v":0}]
[null,null,169,"Dengue (5)",{"$f":"GETPIVOTDATA(\"Suma de metax656\",TD!$A$256)","v":0},{"$f":"GETPIVOTDATA(\"Suma de metax657\",TD!$A$256)","v":0},{"$f":"GETPIVOTDATA(\"Suma de metax658\",TD!$A$256)","v":0},{"$f":"GETPIVOTDATA(\"Suma de metax659\",TD!$A$256)","v":0},{"$f":"GETPIVOTDATA(\"Suma de metax660\",TD!$A$256)","v":0},{"$f":"GETPIVOTDATA(\"Suma de metax661\",TD!$A$256)","v":0}]
[null,null,170,"Chikungunya (2)",{"$f":"GETPIVOTDATA(\"Suma de metax662\",TD!$A$256)","v":0},{"$f":"GETPIVOTDATA(\"Suma de metax663\",TD!$A$256)","v":0},{"$f":"GETPIVOTDATA(\"Suma de metax664\",TD!$A$256)","v":0},{"$f":"GETPIVOTDATA(\"Suma de metax665\",TD!$A$256)","v":0},{"$f":"GETPIVOTDATA(\"Suma de metax666\",TD!$A$256)","v":0},{"$f":"GETPIVOTDATA(\"Suma de metax667\",TD!$A$256)","v":0}]
[null,null,171,"Zika (3)",{"$f":"GETPIVOTDATA(\"Suma de metax668\",TD!$A$256)","v":0},{"$f":"GETPIVOTDATA(\"Suma de metax669\",TD!$A$256)","v":0},{"$f":"GETPIVOTDATA(\"Suma de metax670\",TD!$A$256)","v":0},{"$f":"GETPIVOTDATA(\"Suma de metax671\",TD!$A$256)","v":0},{"$f":"GETPIVOTDATA(\"Suma de metax672\",TD!$A$256)","v":0},{"$f":"GETPIVOTDATA(\"Suma de metax673\",TD!$A$256)","v":0}]
[null,null,172,"Bartonelosis (6)",{"$f":"GETPIVOTDATA(\"Suma de metax674\",TD!$A$256)","v":0},{"$f":"GETPIVOTDATA(\"Suma de metax675\",TD!$A$256)","v":0},{"$f":"GETPIVOTDATA(\"Suma de metax676\",TD!$A$256)","v":0},{"$f":"GETPIVOTDATA(\"Suma de metax677\",TD!$A$256)","v":0},{"$f":"GETPIVOTDATA(\"Suma de metax678\",TD!$A$256)","v":0},{"$f":"GETPIVOTDATA(\"Suma de metax679\",TD!$A$256)","v":0}]
[null,null,173,"Fiebre Amarilla (7)",{"$f":"GETPIVOTDATA(\"Suma de metax680\",TD!$A$256)","v":0},{"$f":"GETPIVOTDATA(\"Suma de metax681\",TD!$A$256)","v":0},{"$f":"GETPIVOTDATA(\"Suma de metax682\",TD!$A$256)","v":0},{"$f":"GETPIVOTDATA(\"Suma de metax683\",TD!$A$256)","v":0},{"$f":"GETPIVOTDATA(\"Suma de metax684\",TD!$A$256)","v":0},{"$f":"GETPIVOTDATA(\"Suma de metax685\",TD!$A$256)","v":0}]
[null,null,174,"Chagas (8)",{"$f":"GETPIVOTDATA(\"Suma de metax686\",TD!$A$256)","v":0},{"$f":"GETPIVOTDATA(\"Suma de metax687\",TD!$A$256)","v":0},{"$f":"GETPIVOTDATA(\"Suma de metax688\",TD!$A$256)","v":0},{"$f":"GETPIVOTDATA(\"Suma de metax689\",TD!$A$256)","v":0},{"$f":"GETPIVOTDATA(\"Suma de metax690\",TD!$A$256)","v":0},{"$f":"GETPIVOTDATA(\"Suma de metax691\",TD!$A$256)","v":0}]
[null,null,175,"Leishmaniosis (9)",{"$f":"GETPIVOTDATA(\"Suma de metax692\",TD!$A$256)","v":0},{"$f":"GETPIVOTDATA(\"Suma de metax693\",TD!$A$256)","v":0},{"$f":"GETPIVOTDATA(\"Suma de metax694\",TD!$A$256)","v":0},{"$f":"GETPIVOTDATA(\"Suma de metax695\",TD!$A$256)","v":0},{"$f":"GETPIVOTDATA(\"Suma de metax696\",TD!$A$256)","v":0},{"$f":"GETPIVOTDATA(\"Suma de metax697\",TD!$A$256)","v":0}]
[]
[null,null,null,"Zoonoticas"]
[null,null,null,null,1,2,3,4,5,6]
[null,null,null,"Tematica","NIVEL INICIAL",null,"NIVEL PRIMARIO",null,"NIVEL SECUNDARIA"]
[null,null,null,null,"Nº","N° de participantes","Nº","N° de participantes","Nº","N° de participantes"]
[null,null,178,"Rabia (4)",{"$f":"GETPIVOTDATA(\"Suma de metax698\",TD!$A$256)","v":0},{"$f":"GETPIVOTDATA(\"Suma de metax699\",TD!$A$256)","v":0},{"$f":"GETPIVOTDATA(\"Suma de metax700\",TD!$A$256)","v":0},{"$f":"GETPIVOTDATA(\"Suma de metax701\",TD!$A$256)","v":0},{"$f":"GETPIVOTDATA(\"Suma de metax702\",TD!$A$256)","v":0},{"$f":"GETPIVOTDATA(\"Suma de metax703\",TD!$A$256)","v":0}]
[null,null,179,"Peste (10)",{"$f":"GETPIVOTDATA(\"Suma de metax704\",TD!$A$256)","v":0},{"$f":"GETPIVOTDATA(\"Suma de metax705\",TD!$A$256)","v":0},{"$f":"GETPIVOTDATA(\"Suma de metax706\",TD!$A$256)","v":0},{"$f":"GETPIVOTDATA(\"Suma de metax707\",TD!$A$256)","v":0},{"$f":"GETPIVOTDATA(\"Suma de metax708\",TD!$A$256)","v":0},{"$f":"GETPIVOTDATA(\"Suma de metax709\",TD!$A$256)","v":0}]
[null,null,180,"Leptospirosis (11)",{"$f":"GETPIVOTDATA(\"Suma de metax710\",TD!$A$256)","v":0},{"$f":"GETPIVOTDATA(\"Suma de metax711\",TD!$A$256)","v":0},{"$f":"GETPIVOTDATA(\"Suma de metax712\",TD!$A$256)","v":0},{"$f":"GETPIVOTDATA(\"Suma de metax713\",TD!$A$256)","v":0},{"$f":"GETPIVOTDATA(\"Suma de metax714\",TD!$A$256)","v":0},{"$f":"GETPIVOTDATA(\"Suma de metax715\",TD!$A$256)","v":0}]
[null,null,181,"Tifus (12)",{"$f":"GETPIVOTDATA(\"Suma de metax716\",TD!$A$256)","v":0},{"$f":"GETPIVOTDATA(\"Suma de metax717\",TD!$A$256)","v":0},{"$f":"GETPIVOTDATA(\"Suma de metax718\",TD!$A$256)","v":0},{"$f":"GETPIVOTDATA(\"Suma de metax719\",TD!$A$256)","v":0},{"$f":"GETPIVOTDATA(\"Suma de metax720\",TD!$A$256)","v":0},{"$f":"GETPIVOTDATA(\"Suma de metax721\",TD!$A$256)","v":0}]
[null,null,182,"Equinococosis (13)",{"$f":"GETPIVOTDATA(\"Suma de metax722\",TD!$A$256)","v":0},{"$f":"GETPIVOTDATA(\"Suma de metax723\",TD!$A$256)","v":0},{"$f":"GETPIVOTDATA(\"Suma de metax724\",TD!$A$256)","v":0},{"$f":"GETPIVOTDATA(\"Suma de metax725\",TD!$A$256)","v":0},{"$f":"GETPIVOTDATA(\"Suma de metax726\",TD!$A$256)","v":0},{"$f":"GETPIVOTDATA(\"Suma de metax727\",TD!$A$256)","v":0}]

{"sheet":"PP018","index":7,"n_rows":126,"n_cols":26,"rows_kept":126,"cut":false,"hidden":false,"merged":[[87,3,87,4],[87,7,87,8],[15,0,126,0],[9,5,9,11],[9,15,9,20],[11,5,11,11],[87,5,87,6],[11,15,11,20],[9,23,9,24],[9,25,9,27],[0,1,0,32],[1,1,1,32],[2,1,2,32],[3,1,3,32],[4,1,4,32],[5,1,5,32],[7,5,7,11],[7,15,7,20],[7,23,7,24],[7,25,7,27],[8,27,8,28]]}
[null,"DIRECCION REGIONAL DE SALUD CUSCO"]
[null,"DIRECCION EJECUTIVA DE INTELIGENCIA SANITARIA"]
[null,"DIRECCION DE ESTADISTICA Y TELECOMUNICACIONES"]
[null,"PROMOCION DE LA SALUD"]
[null,"INFORME OPERACIONAL MENSUAL"]
[null,"ENFERMEDADES NO TRANSMISIBLES"]
[]
[null,null,"RED DE SALUD",null,null,{"$f":"[1]TD!F3","v":"(All)"},null,null,null,null,null,null,null,"PROVINCIA",null,{"$f":"[1]TD!F6","v":"(All)"},null,null,null,null,null,null,null,"AÑO :",null,{"$f":"TD!C10","v":"2024"}]
[]
[null,null,"MICRO RED",null,null,{"$f":"[1]TD!F4","v":"(All)"},null,null,null,null,null,null,null,"DISTRITO",null,{"$f":"[1]TD!F7","v":"(All)"},null,null,null,null,null,null,null,"MES :",null,{"$f":"TD!O17","v":"ENERO - DICIEMBRE"}]
[]
[null,null,"ESTABLECIMIENTO",null,null,{"$f":"[1]TD!F5","v":"(All)"},null,null,null,null,null,null,null,"U.E.",null,{"$f":"TD!F8","v":"(All)"}]
[]
[]
[]
["PROGRAMA PRESUPUESTAL ENFERMEDADES NO TRANSMISIBLES PP018",null,"1. FAMILIAS QUE RECIBEN SESIONES EDUCATIVAS Y DEMOSTRATIVAS EN PRÁCTICAS SALUDABLES FRENTE A LAS ENFERMEDADES NO TRASMISIBLES"]
[null,null,null,null,1]
[null,null,null,"Tématica","Nº registros"]
[null,null,1,"Alimentación saludables (ALI)",{"$f":"GETPIVOTDATA(\"Suma de trans_01\",TD!$A$32)","v":319}]
[null,null,2,"Actividad Física (AFI)",{"$f":"GETPIVOTDATA(\"Suma de trans_02\",TD!$A$32)","v":295}]
[null,null,3,"Salud bucal (SBU)",{"$f":"GETPIVOTDATA(\"Suma de trans_03\",TD!$A$32)","v":237}]
[null,null,4,"Salud ocular (SO)",{"$f":"GETPIVOTDATA(\"Suma de trans_04\",TD!$A$32)","v":265}]
[null,null,5,"Sueño adecuado (1)",{"$f":"GETPIVOTDATA(\"Suma de trans_05\",TD!$A$32)","v":280}]
[null,null,6,"Gestión de estres (2)",{"$f":"GETPIVOTDATA(\"Suma de trans_06\",TD!$A$32)","v":280}]
[null,null,7,"Metales pesados (181)",{"$f":"GETPIVOTDATA(\"Suma de trans_07\",TD!$A$32)","v":0}]
[]
[null,null,null,"trazador",{"$f":"E24","v":280}]
[]
[null,null,"2. FUNCIONARIOS MUNICIPALES SENSIBILIZADOS PARA LA\nGENERACION DE ENTORNOS SALUDABLES FRENTE A LAS ENFERMEDADES NO\nTRASMISIBLES"]
[]
[null,null,null,"FASE 1:PLANIFIACIÓN"]
[null,null,null,null,1,2]
[null,null,null,null,"Reuniones (PP)","Reuniones (FSE)"]
[null,null,9,"1º reunión",{"$f":"GETPIVOTDATA(\"Suma de trans_09\",TD!$A$32)","v":0},{"$f":"GETPIVOTDATA(\"Suma de trans_10\",TD!$A$32)","v":0}]
[null,null,10,"2º reunión",{"$f":"GETPIVOTDATA(\"Suma de trans_11\",TD!$A$32)","v":0},{"$f":"GETPIVOTDATA(\"Suma de trans_12\",TD!$A$32)","v":0}]
[null,null,11,"3º … reunión",{"$f":"GETPIVOTDATA(\"Suma de trans_13\",TD!$A$32)","v":0},{"$f":"GETPIVOTDATA(\"Suma de trans_14\",TD!$A$32)","v":0}]
[]
[null,null,null,"FASE 2: REUNIÓN DE ORGANIZACIÓN"]
[null,null,null,1,2]
[null,null,null,"Reuniones","Participantes"]
[null,null,11,{"$f":"GETPIVOTDATA(\"Suma de trans_16\",TD!$A$32)","v":0},{"$f":"GETPIVOTDATA(\"Suma de trans_17\",TD!$A$32)","v":0}]
[]
[]
[null,null,null,"FASE 3: REUNIÓN DE  EVALUACIÓN"]
[null,null,null,1,2]
[null,null,null,"Reuniones","Participantes"]
[null,null,12,{"$f":"GETPIVOTDATA(\"Suma de trans_18\",TD!$A$32)","v":0},{"$f":"GETPIVOTDATA(\"Suma de trans_19\",TD!$A$32)","v":0}]
[]
[null,null,null,"trazador",{"$f":"E47","v":0}]
[]
[null,null,"3. DOCENTES COMPROMETIDOS QUE DESARROLLAN ACCIONES PARA LA PROMOCIÓN DE LA ALIMENTACIÓN SALUDABLE, ACTIVIDAD FÍSICA, SALUD OCULAR Y SALUD BUCAL"]
[]
[null,null,null,"INCIDENCIA"]
[null,null,null,1,2]
[null,null,null,"Reuniones","Participantes"]
[null,null,13,{"$f":"GETPIVOTDATA(\"Suma de trans_20\",TD!$A$32)","v":0},{"$f":"GETPIVOTDATA(\"Suma de trans_21\",TD!$A$32)","v":0}]
[]
[null,null,null,"REUNIÓN DE PLANIFICACIÓN",null,"NUEVO REGISTRO"]
[null,null,null,1,2]
[null,null,null,"Reuniones","Participantes"]
[null,null,14,{"$f":"GETPIVOTDATA(\"Suma de trans_22\",TD!$A$32)","v":0},{"$f":"GETPIVOTDATA(\"Suma de trans_23\",TD!$A$32)","v":0}]
[]
[null,null,null,"REUNIÓN DE ASISTENCIA TÉCNICA",null,"NUEVO REGISTRO"]
[null,null,null,1,1,2]
[null,null,null,"Nº REUNIONES ","Reuniones","Participantes"]
[null,null,15,"1º reunión",{"$f":"GETPIVOTDATA(\"Suma de trans_24\",TD!$A$32)","v":0},{"$f":"GETPIVOTDATA(\"Suma de trans_25\",TD!$A$32)","v":0}]
[null,null,null,"2º reunión",{"$f":"GETPIVOTDATA(\"Suma de trans_26\",TD!$A$32)","v":0},{"$f":"GETPIVOTDATA(\"Suma de trans_27\",TD!$A$32)","v":0}]
[]
[null,null,null,"REUNIÓN DE EVALUACIÓN",null,"NUEVO REGISTRO"]
[]
[null,null,null,1,2]
[null,null,null,"Reuniones","Participantes"]
[null,null,16,{"$f":"GETPIVOTDATA(\"Suma de trans_28\",TD!$A$32)","v":0},{"$f":"GETPIVOTDATA(\"Suma de trans_29\",TD!$A$32)","v":0}]
[]
[null,null,null,"REUNIÓN DE INFORME",null,"NUEVO REGISTRO"]
[null,null,null,1,2]
[null,null,null,"Reuniones","Participantes"]
[null,null,17,{"$f":"GETPIVOTDATA(\"Suma de trans_30\",TD!$A$32)","v":0},{"$f":"GETPIVOTDATA(\"Suma de trans_31\",TD!$A$32)","v":0}]
[]
[null,null,null,"INCIDENCIA ante la Institución educativa",null,"NUEVO REGISTRO"]
[]
[null,null,null,1,2]
[null,null,null,"Reuniones","Participantes"]
[null,null,18,{"$f":"GETPIVOTDATA(\"Suma de trans_32\",TD!$A$32)","v":1},{"$f":"GETPIVOTDATA(\"Suma de trans_33\",TD!$A$32)","v":36}]
[]
[null,null,null,"CAPACITACIÒN A DOCENTES Y DIRECTIVOS DE EDUCACIÓN BÁSICA"]
[null,null,null,1,2,3,4,5,6]
[null,null,null,"NIVEL INICIAL",null,"NIVEL PRIMARIO",null,"NIVEL SECUNDARIA"]
[null,null,null,"Reunion","Participantes","Reunion","Participantes","Reunion","Participantes"]
[null,null,null,{"$f":"GETPIVOTDATA(\"Suma de trans_34\",TD!$A$32)","v":0},{"$f":"GETPIVOTDATA(\"Suma de trans_35\",TD!$A$32)","v":0},{"$f":"GETPIVOTDATA(\"Suma de trans_36\",TD!$A$32)","v":0},{"$f":"GETPIVOTDATA(\"Suma de trans_37\",TD!$A$32)","v":0},{"$f":"GETPIVOTDATA(\"Suma de trans_38\",TD!$A$32)","v":0},{"$f":"GETPIVOTDATA(\"Suma de trans_39\",TD!$A$32)","v":0}]
[]
[null,null,null,"trazador",{"$f":"GETPIVOTDATA(\"Suma de trans_40\",TD!$A$32)","v":0}]
[]
[null,null,null,"INCIDENCIA","NUEVO REGISTRO"]
[null,null,null,1,2]
[null,null,null,"Reuniones","Participantes"]
[null,null,19,{"$f":"GETPIVOTDATA(\"Suma de trans_41\",TD!$A$32)","v":0},{"$f":"GETPIVOTDATA(\"Suma de trans_42\",TD!$A$32)","v":0}]
[]
[null,null,null,"ACOMPAÑAMIENTO - MONITOREO",null,"NUEVO REGISTRO"]
[null,null,null,1,2]
[null,null,null,"Reuniones","Participantes"]
[null,null,20,{"$f":"GETPIVOTDATA(\"Suma de trans_43\",TD!$A$32)","v":6},{"$f":"GETPIVOTDATA(\"Suma de trans_44\",TD!$A$32)","v":204}]
[]
[null,null,"4. LIDERES COMUNITARIOS CAPACITADOS REALIZAN\nVIGILANCIA CIUDADANA PARA LA REDUCCION DE LA CONTAMINACIÓN POR METALES\nPESADOS, SUSTANCIAS QUÍMICAS E HIDROCARBUROS"]
[null,null,null,"FASE 1: REUNIÓN DE INCIDENCIA",null,"NUEVO REGISTRO"]
[null,null,null,1,2]
[null,null,null,"Reuniones","Participantes"]
[null,null,21,{"$f":"GETPIVOTDATA(\"Suma de trans_45\",TD!$A$32)","v":0},{"$f":"GETPIVOTDATA(\"Suma de trans_46\",TD!$A$32)","v":0}]
[null,null,null,"SESIONES EDUCATIVAS Y DEMOSTRATIVAS",null,"NUEVO REGISTRO"]
[null,null,null,1,1,2]
[null,null,null,"Nº de sesiones educativas/demostrativas","Nº","Participantes"]
[null,null,22,"1º Sesión",{"$f":"GETPIVOTDATA(\"Suma de trans_47\",TD!$A$32)","v":0},{"$f":"GETPIVOTDATA(\"Suma de trans_48\",TD!$A$32)","v":0}]
[null,null,23,"2º Sesión",{"$f":"GETPIVOTDATA(\"Suma de trans_49\",TD!$A$32)","v":0},{"$f":"GETPIVOTDATA(\"Suma de trans_50\",TD!$A$32)","v":0}]
[]
[null,null,null,"trazador",{"$f":"F113","v":0}]
[]
[null,null,null,"REUNIONES DE ACOMPAÑAMIENTO - MONITOREO",null,"NUEVO REGISTRO"]
[null,null,null,1,1,2]
[null,null,null,"Nº Monitoreo","Nº","Nº organizaciones "]
[null,null,24,"1º Monitoreo",{"$f":"GETPIVOTDATA(\"Suma de trans_51\",TD!$A$32)","v":0},{"$f":"GETPIVOTDATA(\"Suma de trans_52\",TD!$A$32)","v":0}]
[null,null,25,"2º Monitoreo",{"$f":"GETPIVOTDATA(\"Suma de trans_53\",TD!$A$32)","v":0},{"$f":"GETPIVOTDATA(\"Suma de trans_54\",TD!$A$32)","v":0}]
[]
[null,null,null,"REUNIÓN DE EVALUACIÓN","NUEVO REGISTRO"]
[null,null,null,1,2]
[null,null,null,"Reuniones","Participantes"]
[null,null,26,{"$f":"GETPIVOTDATA(\"Suma de trans_55\",TD!$A$32)","v":0},{"$f":"GETPIVOTDATA(\"Suma de trans_56\",TD!$A$32)","v":0}]

{"sheet":"PP024","index":8,"n_rows":92,"n_cols":22,"rows_kept":92,"cut":false,"hidden":false,"merged":[[79,6,79,7],[89,3,89,4],[89,5,89,6],[11,4,11,7],[11,11,11,16],[36,3,36,4],[36,5,36,6],[67,4,67,5],[67,6,67,7],[79,4,79,5],[7,4,7,7],[7,11,7,14],[7,21,7,24],[9,4,9,7],[9,11,9,14],[9,21,9,24],[5,0,5,31],[0,0,0,31],[1,0,1,31],[2,0,2,31],[3,0,3,31],[4,0,4,31]]}
["DIRECCION REGIONAL DE SALUD CUSCO"]
["DIRECCION EJECUTIVA DE INTELIGENCIA SANITARIA"]
["DIRECCION DE ESTADISTICA Y TELECOMUNICACIONES"]
["PROMOCION DE LA SALUD"]
["INFORME OPERACIONAL MENSUAL"]
["CONTROL Y PREVENCION DEL CANCER"]
[]
[null,"RED DE SALUD",null,null,{"$f":"TD!F3","v":"(All)"},null,null,null,null,"PROVINCIA",null,{"$f":"TD!F6","v":"(All)"},null,null,null,null,null,null,null,"AÑO :",null,{"$f":"TD!C10","v":"2024"}]
[]
[null,"MICRO RED",null,null,{"$f":"TD!F4","v":"(All)"},null,null,null,null,"DISTRITO",null,{"$f":"TD!F7","v":"(All)"},null,null,null,null,null,null,null,"MES :",null,{"$f":"TD!O17","v":"ENERO - DICIEMBRE"}]
[]
[null,"ESTABLECIMIENTO",null,null,{"$f":"TD!F5","v":"(All)"},null,null,null,null,"U.E.",null,{"$f":"TD!F8","v":"(All)"}]
[]
[]
["\nPROGRAMA PRESUPUESTAL 024","ACTIVIDAD CAPACITACIÓN A ACTORES SOCIALES","1. FAMILIAS SENSIBILIZADAS PARA LA PROMOCIÓN DE\nPRÁCTICAS Y ENTORNOS SALUDABLES"]
[null,null,null,"Sesiones educativas a familias"]
[null,null,null,null,1]
[null,null,null,"Tématica","Nº registros"]
[null,null,1,"Evitar consumo y exposición al humo de tabaco (TA)",{"$f":"GETPIVOTDATA(\"Suma de cancer01\",TD!$A$87)","v":264}]
[null,null,2,"Reducción del consumo de alcohol (AD)",{"$f":"GETPIVOTDATA(\"Suma de cancer02\",TD!$A$87)","v":278}]
[null,null,3,"Promoción de la higiene y cuidado del ambiente\n(HA)",{"$f":"GETPIVOTDATA(\"Suma de cancer03\",TD!$A$87)","v":235}]
[null,null,4,"Salud sexual y reproductiva (SSI)",{"$f":"GETPIVOTDATA(\"Suma de cancer04\",TD!$A$87)","v":265}]
[]
[null,null,null,"trazador",{"$f":"E20","v":278}]
[]
[null,null,"2. FUNCIONARIOS MUNICIPALES SENSIBILIZADOS PARA LA PROMOCIÓN DE PRÁCTICAS Y ENTORNOS SALUDABLES PARA LA PREVENCIÓN DEL CÁNCER"]
[]
[null,null,null,"Reunión de sensibilización",null,"NUEVO REGISTRO"]
[]
[null,null,null,1,2]
[null,null,null,"Reuniones","Participantes"]
[null,null,6,{"$f":"GETPIVOTDATA(\"Suma de cancer06\",TD!$A$87)","v":0},{"$f":"GETPIVOTDATA(\"Suma de cancer07\",TD!$A$87)","v":0}]
[]
[null,null,null,"Asistencia técnica"]
[]
[null,null,null,1,2,3,4]
[null,null,null,"Asistencia Tecnica 1",null,"Asistencia Tecnica 2"]
[null,null,null,"N°","Participantes","N°","Participantes"]
[null,null,7,{"$f":"GETPIVOTDATA(\"Suma de cancer09\",TD!$A$87)","v":0},{"$f":"GETPIVOTDATA(\"Suma de cancer10\",TD!$A$87)","v":0},{"$f":"GETPIVOTDATA(\"Suma de cancer11\",TD!$A$87)","v":0},{"$f":"GETPIVOTDATA(\"Suma de cancer12\",TD!$A$87)","v":0}]
[]
[null,null,null,"trazador",{"$f":"G39","v":0}]
[]
[null,null,null,"Reunión de monitoreo"]
[]
[null,null,null,1,2]
[null,null,null,"1º  Monitoreo ","2º  Monitoreo"]
[null,null,8,{"$f":"GETPIVOTDATA(\"Suma de cancer13\",TD!$A$87)","v":0},{"$f":"GETPIVOTDATA(\"Suma de cancer14\",TD!$A$87)","v":0}]
[]
[null,null,null,"Sesión educativa en comunidad",null,"NUEVO REGISTRO"]
[null,null,null,null,1]
[null,null,null,"Tématica","Nº registros"]
[null,null,9,"Evitar consumo y exposición al humo de tabaco (TA)",{"$f":"GETPIVOTDATA(\"Suma de cancer15\",TD!$A$87)","v":0}]
[null,null,10,"Reducción del consumo de alcohol (AD)",{"$f":"GETPIVOTDATA(\"Suma de cancer16\",TD!$A$87)","v":0}]
[null,null,11,"Promoción de la higiene y cuidado del ambiente\n(HA)",{"$f":"GETPIVOTDATA(\"Suma de cancer17\",TD!$A$87)","v":0}]
[null,null,12,"Salud sexual y reproductiva (SSI)",{"$f":"GETPIVOTDATA(\"Suma de cancer18\",TD!$A$87)","v":0}]
[]
[null,null,"3. DOCENTES CAPACITADOS PARA LA PROMOCIÓN DE PRÁCTICAS Y ENTORNOS SALUDABLES PARA LA PREVENCIÓN DEL CÁNCER"]
[]
[null,null,null,"Reunión de coordinación"]
[null,null,null,null,1,2]
[null,null,null,null,"NIVEL PRIMARIO","NIVEL SECUNDARIA"]
[null,null,13,"Nº REUNIÓN","Reunion","Reunion"]
[null,null,14,"1º Reunión",{"$f":"GETPIVOTDATA(\"Suma de cancer19\",TD!$A$87)","v":0},{"$f":"GETPIVOTDATA(\"Suma de cancer20\",TD!$A$87)","v":2}]
[null,null,15,"2º Reunión",{"$f":"GETPIVOTDATA(\"Suma de cancer21\",TD!$A$87)","v":0},{"$f":"GETPIVOTDATA(\"Suma de cancer22\",TD!$A$87)","v":2}]
[]
[null,null,null,"Taller de capacitación a docentes"]
[null,null,null,null,1,2,3,4]
[null,null,null,null,"NIVEL PRIMARIO",null,"NIVEL SECUNDARIA"]
[null,null,null,"Tématica","Nº","Participantes","Nº","Participantes"]
[null,null,16,"Evitar consumo y exposición al humo de tabaco (TA)",{"$f":"GETPIVOTDATA(\"Suma de cancer23\",TD!$A$87)","v":0},{"$f":"GETPIVOTDATA(\"Suma de cancer24\",TD!$A$87)","v":0},{"$f":"GETPIVOTDATA(\"Suma de cancer25\",TD!$A$87)","v":1},{"$f":"GETPIVOTDATA(\"Suma de cancer26\",TD!$A$87)","v":30}]
[null,null,17,"Reducción del consumo de alcohol (AD)",{"$f":"GETPIVOTDATA(\"Suma de cancer27\",TD!$A$87)","v":0},{"$f":"GETPIVOTDATA(\"Suma de cancer28\",TD!$A$87)","v":0},{"$f":"GETPIVOTDATA(\"Suma de cancer29\",TD!$A$87)","v":0},{"$f":"GETPIVOTDATA(\"Suma de cancer30\",TD!$A$87)","v":0}]
[null,null,18,"Promoción de la higiene y cuidado del ambiente\n(HA)",{"$f":"GETPIVOTDATA(\"Suma de cancer31\",TD!$A$87)","v":0},{"$f":"GETPIVOTDATA(\"Suma de cancer32\",TD!$A$87)","v":0},{"$f":"GETPIVOTDATA(\"Suma de cancer33\",TD!$A$87)","v":0},{"$f":"GETPIVOTDATA(\"Suma de cancer34\",TD!$A$87)","v":0}]
[null,null,19,"Salud sexual y reproductiva (SSI)",{"$f":"GETPIVOTDATA(\"Suma de cancer35\",TD!$A$87)","v":0},{"$f":"GETPIVOTDATA(\"Suma de cancer36\",TD!$A$87)","v":0},{"$f":"GETPIVOTDATA(\"Suma de cancer37\",TD!$A$87)","v":0},{"$f":"GETPIVOTDATA(\"Suma de cancer38\",TD!$A$87)","v":0}]
[]
[null,null,null,"trazador",{"$f":"F71+H71","v":0}]
[]
[null,null,null,"Sesiones educativas a padres de familia"]
[]
[null,null,null,null,1,2,3,4]
[null,null,null,null,"NIVEL PRIMARIO",null,"NIVEL SECUNDARIA"]
[null,null,null,"Tématica","Nº","Participantes","Nº","Participantes"]
[null,null,20,"Evitar consumo y exposición al humo de tabaco (TA)",{"$f":"GETPIVOTDATA(\"Suma de cancer40\",TD!$A$87)","v":0},{"$f":"GETPIVOTDATA(\"Suma de cancer41\",TD!$A$87)","v":0},{"$f":"GETPIVOTDATA(\"Suma de cancer42\",TD!$A$87)","v":0},{"$f":"GETPIVOTDATA(\"Suma de cancer43\",TD!$A$87)","v":0}]
[null,null,21,"Reducción del consumo de alcohol (AD)",{"$f":"GETPIVOTDATA(\"Suma de cancer44\",TD!$A$87)","v":0},{"$f":"GETPIVOTDATA(\"Suma de cancer45\",TD!$A$87)","v":0},{"$f":"GETPIVOTDATA(\"Suma de cancer46\",TD!$A$87)","v":0},{"$f":"GETPIVOTDATA(\"Suma de cancer47\",TD!$A$87)","v":0}]
[null,null,22,"Promoción de la higiene y cuidado del ambiente\n(HA)",{"$f":"GETPIVOTDATA(\"Suma de cancer48\",TD!$A$87)","v":0},{"$f":"GETPIVOTDATA(\"Suma de cancer49\",TD!$A$87)","v":0},{"$f":"GETPIVOTDATA(\"Suma de cancer50\",TD!$A$87)","v":0},{"$f":"GETPIVOTDATA(\"Suma de cancer51\",TD!$A$87)","v":0}]
[null,null,23,"Salud sexual y reproductiva (SSI)",{"$f":"GETPIVOTDATA(\"Suma de cancer52\",TD!$A$87)","v":0},{"$f":"GETPIVOTDATA(\"Suma de cancer53\",TD!$A$87)","v":0},{"$f":"GETPIVOTDATA(\"Suma de cancer54\",TD!$A$87)","v":0},{"$f":"GETPIVOTDATA(\"Suma de cancer55\",TD!$A$87)","v":0}]
[]
[null,null,null,"Monitoreo"]
[]
[null,null,null,1,2,3,4]
[null,null,null,"NIVEL PRIMARIO",null,"NIVEL SECUNDARIA"]
[null,null,null,"Nº","Participantes","Nº","Participantes"]
[null,null,24,{"$f":"GETPIVOTDATA(\"Suma de cancer56\",TD!$A$87)","v":0},{"$f":"GETPIVOTDATA(\"Suma de cancer57\",TD!$A$87)","v":0},{"$f":"GETPIVOTDATA(\"Suma de cancer58\",TD!$A$87)","v":6},{"$f":"GETPIVOTDATA(\"Suma de cancer59\",TD!$A$87)","v":112}]

{"sheet":"PP031","index":9,"n_rows":91,"n_cols":23,"rows_kept":91,"cut":false,"hidden":false,"merged":[[17,4,17,6],[17,7,17,9],[11,12,11,17],[5,1,5,25],[0,1,0,25],[1,1,1,25],[2,1,2,25],[3,1,3,25],[4,1,4,25],[7,5,7,8],[7,12,7,16],[7,22,7,25],[9,5,9,8],[9,12,9,16],[9,22,9,25],[11,5,11,8]]}
[null,"DIRECCION REGIONAL DE SALUD CUSCO"]
[null,"DIRECCION EJECUTIVA DE INTELIGENCIA SANITARIA"]
[null,"DIRECCION DE ESTADISTICA Y TELECOMUNICACIONES"]
[null,"PROMOCION DE LA SALUD"]
[null,"INFORME OPERACIONAL MENSUAL"]
[null,"SALUD MENTAL"]
[]
[null,null,"RED DE SALUD",null,null,{"$f":"TD!F3","v":"(All)"},null,null,null,null,"PROVINCIA",null,{"$f":"TD!F6","v":"(All)"},null,null,null,null,null,null,null,"AÑO :",null,{"$f":"TD!C10","v":"2024"}]
[]
[null,null,"MICRO RED",null,null,{"$f":"TD!F4","v":"(All)"},null,null,null,null,"DISTRITO",null,{"$f":"TD!F7","v":"(All)"},null,null,null,null,null,null,null,"MES :",null,{"$f":"TD!O17","v":"ENERO - DICIEMBRE"}]
[]
[null,null,"ESTABLECIMIENTO",null,null,{"$f":"TD!F5","v":"(All)"},null,null,null,null,"U.E.",null,{"$f":"TD!F8","v":"(All)"}]
[]
[]
[null,null,"1. MADRES, PADRES Y CUIDADORES/AS CON APOYO EN ESTRATEGIAS DE CRIANZA Y CONOCIMIENTOS SOBRE EL DESARROLLO INFANTIL"]
[null,null,null,"Consejeria","NUEVO REGISTRO"]
[]
[null,null,null,null,"VISITA DOMICILIARIA ",null,null,"TELEORIENTACIÓN"]
[null,null,null,"EDAD","1º consejeria ","2º consejeria ","3º consejeria ","1º consejeria ","2º consejeria ","3º consejeria "]
[null,null,null,"<1AÑO",{"$f":"GETPIVOTDATA(\"Suma de mental_01_1\",TD!$A$142)","v":0},{"$f":"GETPIVOTDATA(\"Suma de mental_01_2\",TD!$A$142)","v":2},{"$f":"GETPIVOTDATA(\"Suma de mental_01_3\",TD!$A$142)","v":0},{"$f":"GETPIVOTDATA(\"Suma de mental_02_1\",TD!$A$142)","v":0},{"$f":"GETPIVOTDATA(\"Suma de mental_02_2\",TD!$A$142)","v":0},{"$f":"GETPIVOTDATA(\"Suma de mental_02_3\",TD!$A$142)","v":0}]
[null,null,null,"1 AÑO",{"$f":"GETPIVOTDATA(\"Suma de mental_03_1\",TD!$A$142)","v":0},{"$f":"GETPIVOTDATA(\"Suma de mental_03_2\",TD!$A$142)","v":0},{"$f":"GETPIVOTDATA(\"Suma de mental_03_3\",TD!$A$142)","v":0},{"$f":"GETPIVOTDATA(\"Suma de mental_04_1\",TD!$A$142)","v":0},{"$f":"GETPIVOTDATA(\"Suma de mental_04_2\",TD!$A$142)","v":0},{"$f":"GETPIVOTDATA(\"Suma de mental_04_3\",TD!$A$142)","v":0}]
[null,null,null,"2 AÑOS ",{"$f":"GETPIVOTDATA(\"Suma de mental_05_1\",TD!$A$142)","v":0},{"$f":"GETPIVOTDATA(\"Suma de mental_05_2\",TD!$A$142)","v":0},{"$f":"GETPIVOTDATA(\"Suma de mental_05_3\",TD!$A$142)","v":0},{"$f":"GETPIVOTDATA(\"Suma de mental_06_1\",TD!$A$142)","v":0},{"$f":"GETPIVOTDATA(\"Suma de mental_06_1\",TD!$A$142)","v":0},{"$f":"GETPIVOTDATA(\"Suma de mental_06_1\",TD!$A$142)","v":0}]
[null,null,null,"3 AÑOS",{"$f":"GETPIVOTDATA(\"Suma de mental_07_1\",TD!$A$142)","v":0},{"$f":"GETPIVOTDATA(\"Suma de mental_07_2\",TD!$A$142)","v":0},{"$f":"GETPIVOTDATA(\"Suma de mental_07_3\",TD!$A$142)","v":0},{"$f":"GETPIVOTDATA(\"Suma de mental_08_1\",TD!$A$142)","v":0},{"$f":"GETPIVOTDATA(\"Suma de mental_08_2\",TD!$A$142)","v":0},{"$f":"GETPIVOTDATA(\"Suma de mental_08_3\",TD!$A$142)","v":0}]
[null,null,null,"4 AÑOS",{"$f":"GETPIVOTDATA(\"Suma de mental_09_1\",TD!$A$142)","v":0},{"$f":"GETPIVOTDATA(\"Suma de mental_09_2\",TD!$A$142)","v":0},{"$f":"GETPIVOTDATA(\"Suma de mental_09_3\",TD!$A$142)","v":0},{"$f":"GETPIVOTDATA(\"Suma de mental_10_1\",TD!$A$142)","v":0},{"$f":"GETPIVOTDATA(\"Suma de mental_10_2\",TD!$A$142)","v":0},{"$f":"GETPIVOTDATA(\"Suma de mental_10_3\",TD!$A$142)","v":0}]
[]
[null,null,null,"trazador (niños <12 meses)",{"$f":"G20+J20+E21+H21+E22+H22+E23+H23+E24+H24","v":0}]
[]
[null,null,"2. PAREJAS CON CONSEJERÍA EN LA PROMOCIÓN DE UNA CONVIVENCIA SALUDABLE"]
[null,null,null,"Coordinación con organizaciones de la comunidad",null,null,null,"NUEVO REGISTRO"]
[null,null,null,1,2]
[null,null,null,"N°","Participantes"]
[null,null,3,{"$f":"GETPIVOTDATA(\"Suma de mental_12\",TD!$A$142)","v":0},{"$f":"GETPIVOTDATA(\"Suma de mental_13\",TD!$A$142)","v":0}]
[]
[null,null,null,"Consejería en convivencia saludable en pareja",null,null,"NUEVO REGISTRO"]
[null,null,null,null,1]
[null,null,null,"Consejeria","Nº registros"]
[null,null,4,"1º Consejeria",{"$f":"GETPIVOTDATA(\"Suma de mental_14\",TD!$A$142)","v":0}]
[null,null,5,"2º Consejeria",{"$f":"GETPIVOTDATA(\"Suma de mental_15\",TD!$A$142)","v":0}]
[null,null,6,"3º Consejeria",{"$f":"GETPIVOTDATA(\"Suma de mental_16\",TD!$A$142)","v":0}]
[null,null,7,"4º Consejeria",{"$f":"GETPIVOTDATA(\"Suma de mental_17\",TD!$A$142)","v":0}]
[]
[null,null,null,"Trazador",{"$f":"E38","v":0}]
[]
[null,null,"3. LÍDERES ADOLESCENTES PROMUEVEN LA SALUD MENTAL EN SU COMUNIDAD"]
[null,null,null,"Coordinación con institución educativa",null,null,"NUEVO REGISTRO"]
[null,null,null,null,1]
[null,null,null,"Reunión","Nº registros"]
[null,null,8,"1º Reunión",{"$f":"GETPIVOTDATA(\"Suma de mental_19\",TD!$A$142)","v":0}]
[null,null,9,"2º Reunión",{"$f":"GETPIVOTDATA(\"Suma de mental_20\",TD!$A$142)","v":0}]
[]
[null,null,null,"Reunión de inducción con docentes",null,null,"NUEVO REGISTRO"]
[null,null,null,null,1,2]
[null,null,null,"Reunión","Nº ","Participantes"]
[null,null,10,"1º Reunión",{"$f":"GETPIVOTDATA(\"Suma de mental_21\",TD!$A$142)","v":0},{"$f":"GETPIVOTDATA(\"Suma de mental_22\",TD!$A$142)","v":0}]
[null,null,11,"2º Reunión",{"$f":"GETPIVOTDATA(\"Suma de mental_23\",TD!$A$142)","v":0},{"$f":"GETPIVOTDATA(\"Suma de mental_24\",TD!$A$142)","v":0}]
[]
[null,null,null,"Taller de capacitación a adolescentes lideres en CDJ",null,null,null,null,"Taller de capacitación a adolescentes lideres en otros Hambientes"]
[null,null,null,1,2,"NUEVO REGISTRO",null,null,1,2,"NUEVO REGISTRO"]
[null,null,null,"Sesión","Nº ",null,null,null,"Sesión","Nº "]
[null,null,12,"1º Sesión",{"$f":"GETPIVOTDATA(\"Suma de mental_25\",TD!$A$142)","v":0},null,null,null,"1º Sesión",{"$f":"GETPIVOTDATA(\"Suma de mental_36\",TD!$A$142)","v":0}]
[null,null,13,"2º Sesión",{"$f":"GETPIVOTDATA(\"Suma de mental_26\",TD!$A$142)","v":0},null,null,null,"2º Sesión",{"$f":"GETPIVOTDATA(\"Suma de mental_37\",TD!$A$142)","v":0}]
[]
[null,null,null,"Trazador",{"$f":"E60+J60","v":0}]
[null,null,null,"Reunión de Monitoreo",null,"NUEVO REGISTRO"]
[null,null,null,1,2]
[null,null,null,"Nº ","Participantes"]
[null,null,9,{"$f":"GETPIVOTDATA(\"Suma de mental_27\",TD!$A$142)","v":0},{"$f":"GETPIVOTDATA(\"Suma de mental_28\",TD!$A$142)","v":0}]
[]
[null,null,null,"Reunión de Evaluación:",null,"NUEVO REGISTRO"]
[null,null,null,1]
[null,null,null,"Nº "]
[null,null,10,{"$f":"GETPIVOTDATA(\"Suma de mental_29\",TD!$A$142)","v":0}]
[]
[null,null,"4. AGENTES COMUNITARIOS DE SALUD REALIZAN VIGILANCIA CIUDADANA PARA REDUCIR LA VIOLENCIA FÍSICA CAUSADA POR LA PAREJA"]
[]
[null,null,null,"Reunión de Incidencia ante organizaciones comunitarias",null,null,null,"NUEVO REGISTRO"]
[null,null,null,1,2]
[null,null,null,"Nº ","Participantes"]
[null,null,11,{"$f":"GETPIVOTDATA(\"Suma de mental_30\",TD!$A$142)","v":0},{"$f":"GETPIVOTDATA(\"Suma de mental_31\",TD!$A$142)","v":0}]
[]
[null,null,null,"Taller de capacitación a miembros de organizaciones comunitarias",null,null,null,"NUEVO REGISTRO"]
[null,null,null,1,2]
[null,null,null,"Nº ","Participantes"]
[null,null,12,{"$f":"GETPIVOTDATA(\"Suma de mental_32\",TD!$A$142)","v":0},{"$f":"GETPIVOTDATA(\"Suma de mental_33\",TD!$A$142)","v":0}]
[]
[null,null,null,"Trazador",{"$f":"GETPIVOTDATA(\"Suma de mental_33\",TD!$A$142)","v":0}]
[]
[null,null,null,"Monitoreo de la implementación de la vigilancia comunitaria"]
[null,null,null,1,2]
[null,null,null,"Nº ","Participantes"]
[null,null,13,{"$f":"GETPIVOTDATA(\"Suma de mental_34\",TD!$A$142)","v":0},{"$f":"GETPIVOTDATA(\"Suma de mental_35\",TD!$A$142)","v":0}]

{"sheet":"OTROS","index":10,"n_rows":225,"n_cols":19,"rows_kept":225,"cut":false,"hidden":false,"merged":[[11,4,11,5],[7,9,7,13],[9,9,9,13],[11,9,11,14],[9,18,9,21],[7,4,7,5],[9,4,9,5],[160,5,160,6],[160,7,160,8],[160,9,160,10],[142,6,142,7],[142,8,142,9],[151,4,151,5],[151,6,151,7],[151,8,151,9],[168,4,168,5],[5,1,5,25],[0,1,0,25],[1,1,1,25],[2,1,2,25],[3,1,3,25],[4,1,4,25],[13,1,165,1],[22,3,22,7],[58,4,58,9],[58,10,58,13],[115,4,115,5],[115,6,115,7],[115,8,115,9],[142,4,142,5],[160,3,160,4]]}
[null,"DIRECCION REGIONAL DE SALUD CUSCO"]
[null,"DIRECCION EJECUTIVA DE INTELIGENCIA SANITARIA"]
[null,"DIRECCION DE ESTADISTICA Y TELECOMUNICACIONES"]
[null,"PROMOCION DE LA SALUD"]
[null,"INFORME OPERACIONAL MENSUAL"]
[null,"SALUD MENTAL"]
[]
[null,null,"RED DE SALUD",null,{"$f":"TD!F3","v":"(All)"},null,null,"PROVINCIA",null,{"$f":"TD!F6","v":"(All)"},null,null,null,null,null,null,"AÑO :",null,{"$f":"TD!C10","v":"2024"}]
[]
[null,null,"MICRO RED",null,{"$f":"TD!F4","v":"(All)"},null,null,"DISTRITO",null,{"$f":"TD!F7","v":"(All)"},null,null,null,null,null,null,"MES :",null,{"$f":"TD!O17","v":"ENERO - DICIEMBRE"}]
[]
[null,null,"ESTABLECIMIENTO",null,{"$f":"TD!F5","v":"(All)"},null,null,"U.E.",null,{"$f":"TD!F8","v":"(All)"}]
[]
[null,"ACTIVIDADES EN FAMILIAS"]
[null,null,"1. ACTIVIDADES DE PROMOCIÓN DE LA SALUD EN ESCENARIO FAMILIAS"]
[]
[null,null,null,"ACCIONES DESARROLLADAS EN EL MARCO DE LA META 4"]
[]
[null,null,null,"Taller de capacitación a los actores sociales en protocolo de visitas domiciliarias para la prevención y control de la anemia infantil.",null,null,null,"usp_TRAMA_BASE_PROMSA_RPT01_PP001_5_2"]
[null,null,null,null,1,2,3,4]
[null,null,null,"Sesiones educativas","Protocolo de la Visita domiciliaria y seguimiento telefónico (PVD/ST) ","Participantes","Anemia, prevención y tratamiento","Participantes"]
[null,null,1,"Sesiones de capacitación a los actores sociales en protocolo de visitas domiciliarias para la prevención y control de la anemia infantil.","CONTAR APP138/ (DX1=C0009+ LAB1+ LAB2=1+ LAB3=1)","SUMAR LAB1 DE APP138/ (DX1=C0009+ LAB1+ LAB2=1+ LAB3=1)","CONTAR APP138/ (DX1=C0009+ LAB1+ LAB2=2+ LAB3=1)","SUMAR LAB1 DE APP138/ (DX1=C0009+ LAB1+ LAB2=2+ LAB3=1)"]
[]
[null,null,null,"Asistencia técnica"]
[null,null,null,"Para la validación de las fichas:",null,"NUEVO REGISTRO"]
[]
[null,null,null,1,2]
[null,null,null,"Nº ","Nº Fichas validadas"]
[null,null,2,"CONTAR APP138/ (DX1=C7004+ LAB1+ LAB2=GL+ LAB3=1) ","SUMAR LAB1 DE APP138/ (DX1=C7004+ LAB1+ LAB2=GL+ LAB3=1) "]
[]
[null,null,null,"Verificación de las visitas domiciliarias:",null,"NUEVO REGISTRO"]
[]
[null,null,null,1,2,3]
[null,null,null,"Nº "," Nº Niños a ser verificados según\naplicativo de visitas domiciliarias","Nº  Niños verificados que cumplieron con\nlos criterios establecido."]
[null,null,3,"CONTAR APP138/ (DX1=C7004+ LAB1+ LAB2+ LAB3=001) ","SUMAR LAB1 DE APP138/ (DX1=C7004+ LAB1+ LAB2+ LAB3=1) ","SUMAR LAB2 DE APP138/ (DX1=C7004+ LAB1+ LAB2+ LAB3=1) "]
[]
[null,null,null,"Monitoreo","usp_TRAMA_BASE_PROMSA_RPT01_PP001_5_5"]
[]
[null,null,null,null,1,2,3,4]
[null,null,null,"Actividades","Monitoreo 1","N° Actor Social","Monitoreo 2","N° Actor Social"]
[null,null,4,"Monitoreo ","CONTAR APP138 / (DX1=C7001 + LAB1+ LAB2=1+LAB3=1)","SUMAR LAB1 DE APP138 / (DX1=C7001 + LAB1+ LAB2=1+LAB3=1)","CONTAR APP138 / (DX1=C7001 + LAB1+ LAB2=2+LAB3=1)","SUMAR LAB1 DE APP138 / (DX1=C7001 + LAB1+ LAB2=2+LAB3=1)"]
[]
[null,null,"2. ACTIVIDADES REALIZADAS CON EL GOBIERNO LOCAL"]
[]
[null,null,null,"Actualización y homologación de padrón nominal de niños (as) menores de 6 años"]
[]
[null,null,null,"ACTIVIDAD","1ra asistencia técnica","2da asistencia técnica"]
[null,null,5,"Asistencia técnica y abogacía por el personal del EE.SS. Al equipo de gestión municipal que gestiona el padrón nominal ",{"$f":"GETPIVOTDATA(\"Suma de otros01\",TD!$A$285)","v":0},{"$f":"GETPIVOTDATA(\"Suma de otros02\",TD!$A$285)","v":0}]
[]
[null,null,null,"Implementación y funcionamiento de los centros de promoción y vigilancia comunal para el cuidado integral de la madre y el niño"]
[]
[null,null,null,"ACTIVIDAD","1ra asistencia técnica","2da asistencia técnica"]
[null,null,6,"Asistencia técnica y abogacía por el personal del EE.SS. Al equipo de gestión municipal que gestiona la implementación y funcionamiento del CPVC (1, 2, 3,)",{"$f":"GETPIVOTDATA(\"Suma de otros03\",TD!$A$285)","v":0},{"$f":"GETPIVOTDATA(\"Suma de otros04\",TD!$A$285)","v":0}]
[]
[null,null,null,"Principales actividades para el funcionamiento del CPVC"]
[]
[null,null,null,"EN SESIONES DEMOSTRATIVAS"]
[]
[null,null,null,"EN SESIONES DEMOSTRATIVAS",null,null,null,null,null,null,"GESTANTE (NORMAL/RIESGO)"]
[null,null,null,"TIPOS DE ACTIVIDAD DE SD/ EDADES","Total de participantes","RN","1 - 5 meses","6 - 8 meses","9 - 11 meses","S/D","Total de participantes","I Trim","II Trim","III Trim"]
[null,null,7,"Lactancia Materna Exclusiva",{"$f":"F61+G61+J61","v":0},{"$f":"GETPIVOTDATA(\"Suma de otros05\",TD!$A$285)","v":0},{"$f":"GETPIVOTDATA(\"Suma de otros06\",TD!$A$285)","v":0},null,null,{"$f":"GETPIVOTDATA(\"Suma de otros07\",TD!$A$285)","v":0},null,null,null,{"$f":"GETPIVOTDATA(\"Suma de otros12\",TD!$A$285)","v":0}]
[null,null,8,"Preparacion de alimentos",{"$f":"H62+I62+J62","v":0},null,null,{"$f":"GETPIVOTDATA(\"Suma de otros07\",TD!$A$285)","v":0},{"$f":"GETPIVOTDATA(\"Suma de otros09\",TD!$A$285)","v":0},{"$f":"GETPIVOTDATA(\"Suma de otros10\",TD!$A$285)","v":0},{"$f":"L62+M62+N62","v":0},{"$f":"GETPIVOTDATA(\"Suma de otros13\",TD!$A$285)","v":0},{"$f":"GETPIVOTDATA(\"Suma de otros14\",TD!$A$285)","v":0},{"$f":"GETPIVOTDATA(\"Suma de otros15\",TD!$A$285)","v":0}]
[]
[null,null,null,"EN SESIONES EDUCATIVAS"]
[]
[null,null,null,"EN SESIONES EDUCATIVAS","N° de sesión educativa","Participantes"]
[null,null,9,"Cuidado de la madre y el niño",{"$f":"GETPIVOTDATA(\"Suma de otros17\",TD!$A$285)","v":0},{"$f":"GETPIVOTDATA(\"Suma de otros18\",TD!$A$285)","v":0}]
[null,null,10,"Importancia del juego y afecto (1°)",{"$f":"GETPIVOTDATA(\"Suma de otros19\",TD!$A$285)","v":0},{"$f":"GETPIVOTDATA(\"Suma de otros20\",TD!$A$285)","v":0}]
[null,null,11,"Importancia del juego y afecto (2°)",{"$f":"GETPIVOTDATA(\"Suma de otros21\",TD!$A$285)","v":0},{"$f":"GETPIVOTDATA(\"Suma de otros22\",TD!$A$285)","v":0}]
[]
[null,null,null,"Vigilancia comunal"]
[]
[null,null,null,"ACTIVIDAD","Actualización de Registro","N° DE GESTANTES / NIÑOS "]
[null,null,12,"Actualización de registro comunal de vigilancia de prácticas en gestantes",{"$f":"GETPIVOTDATA(\"Suma de otros23\",TD!$A$285)","v":0},{"$f":"GETPIVOTDATA(\"Suma de otros24\",TD!$A$285)","v":0}]
[null,null,13,"Actualización de registro comunal de vigilancia de prácticas en niños (as)",{"$f":"GETPIVOTDATA(\"Suma de otros25\",TD!$A$285)","v":0},{"$f":"GETPIVOTDATA(\"Suma de otros26\",TD!$A$285)","v":0}]
[]
[null,null,null,"TOMA DE DECISIONES"]
[]
[null,null,null,"ACTIVIDAD","1°","N° de participantes","2°","N° de participantes",">2°","N° de participantes"]
[null,null,14,"Actividad en Centro de Promoción y Vigilancia Comunal ",{"$f":"GETPIVOTDATA(\"Suma de otros27\",TD!$A$285)","v":0},{"$f":"GETPIVOTDATA(\"Suma de otros28\",TD!$A$285)","v":0},{"$f":"GETPIVOTDATA(\"Suma de otros29\",TD!$A$285)","v":0},{"$f":"GETPIVOTDATA(\"Suma de otros30\",TD!$A$285)","v":0},{"$f":"GETPIVOTDATA(\"Suma de otros31\",TD!$A$285)","v":0},{"$f":"GETPIVOTDATA(\"Suma de otros32\",TD!$A$285)","v":0}]
[]
[null,null,null,"Estímulos no monetarios a los agentes comunitarios de salud"]
[]
[null,null,null,"ACTIVIDAD","1ra asistencia técnica","2da asistencia técnica"]
[null,null,15,"Asistencia técnica y abogacía por el personal del EE.SS. Al equipo de gestión municipal que gestiona el reconocimiento a los ACS",{"$f":"GETPIVOTDATA(\"Suma de otros33\",TD!$A$285)","v":0},{"$f":"GETPIVOTDATA(\"Suma de otros34\",TD!$A$285)","v":0}]
[]
[null,null,null,"Monitoreo por el personal del EESS al equipo de gestión municipal que gestiona el reconocimiento a los ACS."]
[]
[null,null,null,"ACTIVIDAD","Entrega de Kit básico","N° de ACS","Entrega de Materiales educativos","N° de ACS","Entrega de Kit básico y Entrega de Materiales educativos","N° de ACS"]
[null,null,16,"01 Monitoreo por el personal del EESS al equipo de gestión municipal que gestiona el\nreconocimiento a los ACS.",{"$f":"GETPIVOTDATA(\"Suma de otros38\",TD!$A$285)","v":0},{"$f":"GETPIVOTDATA(\"Suma de otros39\",TD!$A$285)","v":0},{"$f":"GETPIVOTDATA(\"Suma de otros40\",TD!$A$285)","v":0},{"$f":"GETPIVOTDATA(\"Suma de otros41\",TD!$A$285)","v":0},{"$f":"GETPIVOTDATA(\"Suma de otros42\",TD!$A$285)","v":0},{"$f":"GETPIVOTDATA(\"Suma de otros43\",TD!$A$285)","v":0}]
[]
[null,null,null,"Realizar ferias integrales de salud y nutrición (diagnóstico y tratamiento de anemia, desparasitación masiva, promoción de la salud y alimentación adecuada)"]
[]
[null,null,null,"Asistencia técnica y abogacía por el personal del EESS al equipo de gestión municipal que gestiona la realización de las ferias integrales de salud y nutrición."]
[]
[null,null,null,"ACTIVIDAD","1ra asistencia técnica","2da asistencia técnica"]
[null,null,17,"Asistencia técnica y abogacía por el personal del EE.SS: al equipo de gestión municipal que gestiona la realización de las ferias integrales de salud y nutrición",{"$f":"GETPIVOTDATA(\"Suma de otros35\",TD!$A$285)","v":0},{"$f":"GETPIVOTDATA(\"Suma de otros36\",TD!$A$285)","v":0}]
[]
[null,null,null,"Ejecución de ferias integrales de salud y nutrición realizadas por la Municipalidad:"]
[]
[null,null,null,"ACTIVIDAD","N° de Ferias realizadas"]
[null,null,18,"Ejecución de ferias integrales de salud y nutrición realizadas por la Municipalidad: ",{"$f":"GETPIVOTDATA(\"Suma de otros37\",TD!$A$285)","v":0}]
[]
[null,null,null,"REGISTRO DE ACTIVIDADES PARA ACCIONES EN METAXÉNICAS: INTERVENCIONES EN CASAS RENUENTES (CR)."]
[]
[null,null,null,"Actividades","Número de casas RENUENTES","Número de casas RECONVERTIDA"]
[null,null,19,"Consejeria",{"$f":"GETPIVOTDATA(\"Suma de otros44\",TD!$A$285)","v":0},{"$f":"GETPIVOTDATA(\"Suma de otros45\",TD!$A$285)","v":0}]
[]
[null,null,null,"Intervenciones en establecimientos de salud relacionados a seguridad vial y cultura de tránsito"]
[]
[null,null,null,null,"Participantes"]
[null,null,20,"Consejeria familiar",{"$f":"GETPIVOTDATA(\"Suma de otros46\",TD!$A$285)","v":0}]
[]
[null,null,null,"Intervenciones relacionadas a gestión de riesgo de desastres"]
[]
[null,null,null,null,"Temporada de bajas temperaturas",null,"Temporada de lluvias",null,"Familias afectadas por desastres"]
[null,null,null,null,"Nº registros","Nº de participantes","Nº registros","Nº de participantes","Nº registros","Nº de participantes"]
[null,null,21,"Orientación familiar",{"$f":"GETPIVOTDATA(\"Suma de otros47\",TD!$A$285)","v":0},{"$f":"GETPIVOTDATA(\"Suma de otros48\",TD!$A$285)","v":0},{"$f":"GETPIVOTDATA(\"Suma de otros49\",TD!$A$285)","v":0},{"$f":"GETPIVOTDATA(\"Suma de otros50\",TD!$A$285)","v":0},{"$f":"GETPIVOTDATA(\"Suma de otros51\",TD!$A$285)","v":0},{"$f":"GETPIVOTDATA(\"Suma de otros52\",TD!$A$285)","v":0}]
[]
[null,null,"3. ACTIVIDADES DE PROMOCIÓN DE LA SALUD EN INSTITUCIONES EDUCATIVAS"]
[]
[null,null,null,"Implementación y funcionamiento de quioscos, cafeterías y comedores saludables en instituciones educativas"]
[]
[null,null,null,"Reunión de concertación con la Red Educativa/Institución Educativa"]
[null,null,null,1,2]
[null,null,null,"Nº registros","Nº de participantes"]
[null,null,23,"CONTAR APP93 / (DX1= C0002+ LAB1+ LAB2=ALI +LAB3=PSA)","SUMAR LAB1 DE APP93 / (DX1= C0002+ LAB1+ LAB2=ALI +LAB3=PSA)"]
[]
[null,null,null,"Reunión de planificación con la Institución Educativa"]
[]
[null,null,null,1,2]
[null,null,null,"Nº registros","Nº de participantes"]
[null,null,24,"CONTAR APP93 / (DX1= C0002+ LAB1+ LAB2=ALI +LAB3=18)","SUMAR LAB1 DE APP93 / (DX1= C0002+ LAB1+ LAB2=ALI +LAB3=18)"]
[]
[null,null,null,"Reunión de ejecución/asistencia técnica con la Institución Educativa"]
[]
[null,null,null,1,2]
[null,null,null,"Nº registros","Nº de participantes"]
[null,null,25,"CONTAR APP93 / (DX1= C7004+ LAB1+ LAB2=ALI +LAB3=18)","SUMAR LAB 1 DE APP93 / (DX1= C7004+ LAB1+ LAB2=ALI +LAB3=18)"]
[]
[null,null,null,"Reunión de monitoreo a quioscos, cafeterías o comedores escolares"]
[null,null,null,null,1,2,3,4,5,6]
[null,null,null,null,"NIVEL INICIAL",null,"NIVEL PRIMARIO",null,"NIVEL SECUNDARIA"]
[null,null,null,"Nivel de Logro","1º visita","2º visita","1º visita","2º visita","1º visita","2º visita"]
[null,null,26," IA = cuando No es Saludable","CONTAR APP107 / (DX1= C0002+ LAB1=1+ LAB2=IA +LAB3=IN)+(DX2=C7001+LAB1=18+LAB2=\"BLANCO\"+LAB3=\"BLANCO\")","CONTAR APP107 / (DX1= C0002+ LAB1=2+ LAB2=IA +LAB3=IN)+(DX2=C7001+LAB1=18+LAB2=\"BLANCO\"+LAB3=\"BLANCO\")","CONTAR APP107 / (DX1= C0002+ LAB1=1+ LAB2=IA +LAB3=TP)+(DX2=C7001+LAB1=18+LAB2=\"BLANCO\"+LAB3=\"BLANCO\")","CONTAR APP107 / (DX1= C0002+ LAB1=2+ LAB2=IA +LAB3=TP)+(DX2=C7001+LAB1=18+LAB2=\"BLANCO\"+LAB3=\"BLANCO\")","CONTAR APP107 / (DX1= C0002+ LAB1=1+ LAB2=IA +LAB3=TS)+(DX2=C7001+LAB1=18+LAB2=\"BLANCO\"+LAB3=\"BLANCO\")","CONTAR APP107 / (DX1= C0002+ LAB1=2+ LAB2=IA +LAB3=TS)+(DX2=C7001+LAB1=18+LAB2=\"BLANCO\"+LAB3=\"BLANCO\")"]
[null,null,27,"CA = cuando está en Proceso","CONTAR APP107 / (DX1= C0002+ LAB1=1+ LAB2=CA +LAB3=IN)+(DX2=C7001+LAB1=18+LAB2=\"BLANCO\"+LAB3=\"BLANCO\")","CONTAR APP107 / (DX1= C0002+ LAB1=2+ LAB2=CA +LAB3=IN)+(DX2=C7001+LAB1=18+LAB2=\"BLANCO\"+LAB3=\"BLANCO\")","CONTAR APP107 / (DX1= C0002+ LAB1=1+ LAB2=CA +LAB3=TP)+(DX2=C7001+LAB1=18+LAB2=\"BLANCO\"+LAB3=\"BLANCO\")","CONTAR APP107 / (DX1= C0002+ LAB1=2+ LAB2=CA +LAB3=TP)+(DX2=C7001+LAB1=18+LAB2=\"BLANCO\"+LAB3=\"BLANCO\")","CONTAR APP107 / (DX1= C0002+ LAB1=1+ LAB2=CA +LAB3=TS)+(DX2=C7001+LAB1=18+LAB2=\"BLANCO\"+LAB3=\"BLANCO\")","CONTAR APP107 / (DX1= C0002+ LAB1=2+ LAB2=CA +LAB3=TS)+(DX2=C7001+LAB1=18+LAB2=\"BLANCO\"+LAB3=\"BLANCO\")"]
[null,null,28," LP = cuando es Saludable","CONTAR APP107 / (DX1= C0002+ LAB1=1+ LAB2=LP +LAB3=IN)+(DX2=C7001+LAB1=18+LAB2=\"BLANCO\"+LAB3=\"BLANCO\")","CONTAR APP107 / (DX1= C0002+ LAB1=2+ LAB2=LP +LAB3=IN)+(DX2=C7001+LAB1=18+LAB2=\"BLANCO\"+LAB3=\"BLANCO\")","CONTAR APP107 / (DX1= C0002+ LAB1=1+ LAB2=LP +LAB3=TP)+(DX2=C7001+LAB1=18+LAB2=\"BLANCO\"+LAB3=\"BLANCO\")","CONTAR APP107 / (DX1= C0002+ LAB1=2+ LAB2=LP +LAB3=TP)+(DX2=C7001+LAB1=18+LAB2=\"BLANCO\"+LAB3=\"BLANCO\")","CONTAR APP107 / (DX1= C0002+ LAB1=1+ LAB2=LP +LAB3=TS)+(DX2=C7001+LAB1=18+LAB2=\"BLANCO\"+LAB3=\"BLANCO\")","CONTAR APP107 / (DX1= C0002+ LAB1=2+ LAB2=LP +LAB3=TS)+(DX2=C7001+LAB1=18+LAB2=\"BLANCO\"+LAB3=\"BLANCO\")"]
[]
[null,null,null,"Reunión de evaluación a quioscos, cafeterías o comedores escolares",null,null,null,"usp_TRAMA_BASE_PROMSA_RPT08_OTRAS_5_2"]
[]
[null,null,null,null,1,2,3,4,5,6]
[null,null,null,null,"NIVEL INICIAL",null,"NIVEL PRIMARIO",null,"NIVEL SECUNDARIA"]
[null,null,null,"Nivel de Logro","1º Evaluación","2º Evaluación","1º Evaluación","2º Evaluación","1º Evaluación","2º Evaluación"]
[null,null,26," IA = cuando No es Saludable","CONTAR APP107 / (DX1= C7003+ LAB1=1+ LAB2=IA +LAB3=IN)","CONTAR APP107 / (DX1= C7003+ LAB1=2+ LAB2=IA +LAB3=IN)","CONTAR APP107 / (DX1= C7003+ LAB1=1+ LAB2=IA +LAB3=TP)","CONTAR APP107 / (DX1= C7003+ LAB1=2+ LAB2=IA +LAB3=TP)","CONTAR APP107 / (DX1= C7003+ LAB1=1+ LAB2=IA +LAB3=TS)","CONTAR APP107 / (DX1= C7003+ LAB1=2+ LAB2=IA +LAB3=TS)"]
[null,null,27,"CA = cuando está en Proceso","CONTAR APP107 / (DX1= C7003+ LAB1=1+ LAB2=CA +LAB3=IN)","CONTAR APP107 / (DX1= C7003+ LAB1=2+ LAB2=CA +LAB3=IN)","CONTAR APP107 / (DX1= C7003+ LAB1=1+ LAB2=CA +LAB3=TP)","CONTAR APP107 / (DX1= C7003+ LAB1=2+ LAB2=CA +LAB3=TP)","CONTAR APP107 / (DX1= C7003+ LAB1=1+ LAB2=CA +LAB3=TS)","CONTAR APP107 / (DX1= C7003+ LAB1=2+ LAB2=CA +LAB3=TS)"]
[null,null,28," LP = cuando es Saludable","CONTAR APP107 / (DX1= C7003+ LAB1=1+ LAB2=LP +LAB3=IN)","CONTAR APP107 / (DX1= C7003+ LAB1=2+ LAB2=LP +LAB3=IN)","CONTAR APP107 / (DX1= C7003+ LAB1=1+ LAB2=LP +LAB3=TP)","CONTAR APP107 / (DX1= C7003+ LAB1=2+ LAB2=LP +LAB3=TP)","CONTAR APP107 / (DX1= C7003+ LAB1=1+ LAB2=LP +LAB3=TS)","CONTAR APP107 / (DX1= C7003+ LAB1=2+ LAB2=LP +LAB3=TS)"]
[]
[null,null,null,"Taller Educativo para Expendedores de Alimentos",null,null,"usp_TRAMA_BASE_PROMSA_RPT08_OTRAS_5_5"]
[]
[null,null,null,1,2,3,4,5,6,7,8]
[null,null,null,"NIVEL INICIAL",null,"NIVEL PRIMARIO",null,"NIVEL SECUNDARIA",null,"NIVEL SECUNDARIA"]
[null,null,null,"Nº","Nº de II.EE","Nº","Nº de II.EE","Nº","Nº de II.EE","Nº","Nº de II.EE"]
[null,null,29,"CONTAR APP149 / (DX1= C0005+ LAB1+ LAB2=IN +LAB3=PSA)","SUMAR LAB1 DE APP149 / (DX1= C0005+ LAB1+ LAB2=IN +LAB3=PSA)","CONTAR APP149 / (DX1= C0005+ LAB1+ LAB2=TP +LAB3=PSA)","SUMAR LAB1 DE  APP149 / (DX1= C0005+ LAB1+ LAB2=TP +LAB3=PSA)","CONTAR APP149 / (DX1= C0005+ LAB1+ LAB2=TP +LAB3=PSA)","SUMAR LAB1 DE  APP149 / (DX1= C0005+ LAB1+ LAB2=TP +LAB3=PSA)","CONTAR APP149 / (DX1= C0005+ LAB1+ LAB2=TE +LAB3=PSA)","SUMAR LAB1 DE APP149 / (DX1= C0005+ LAB1+ LAB2=TE +LAB3=PSA)"]
[]
[null,null,"4. ACTIVIDADES DE PROMOCIÓN DE LA SALUD EN ESCENARIO COMUNIDADES"]
[]
[null,null,null,"Sesiones Educativas a Gestantes alojadas en la Casa Materna"]
[]
[null,null,null,null,"ACTIVIDAD CON GESTANTES"]
[null,null,null,null,"N°","Participantes"]
[null,null,33,"Sesión ",{"$f":"GETPIVOTDATA(\"Suma de otros53\",TD!$A$285)","v":0},{"$f":"GETPIVOTDATA(\"Suma de otros54\",TD!$A$285)","v":0}]
[]
[null,null,null,"Adolescentes que participan de sesiones educativas de salud sexual en el CDJ"]
[]
[null,null,null,null,"N°","Participantes"]
[null,null,34,"Sesión ",{"$f":"GETPIVOTDATA(\"Suma de otros55\",TD!$A$285)","v":0},{"$f":"GETPIVOTDATA(\"Suma de otros56\",TD!$A$285)","v":0}]
[]
[null,null,null,"Consejería sobre estilos de vida y ambientes saludables para la prevención de transmisión de COVID-19"]
[]
[null,null,null,"Para el registro de la consejería únicamente en lavado de manos social"]
[]
[null,null,null,null,"Nº registros"]
[null,null,35,"Consejeria (VISITA DOMICILIARIA)",{"$f":"GETPIVOTDATA(\"Suma de otros73\",TD!$A$285)","v":0}]
[null,null,36,"Consejeria (TELEORIENTACIÓN SINCRONA)",{"$f":"GETPIVOTDATA(\"Suma de otros74\",TD!$A$285)","v":0}]
[null,null,37,"TRAZADOR ",{"$f":"SUM(E183:E184)","v":0}]
[]
[null,null,null,"Para el registro de la consejería en otras temáticas",null,"ADENDA"]
[]
[null,null,null,"Tematica","Nº registros"]
[null,null,38,"(VD)Medidas preventivas frente al COVID-19: higiene respiratoria, uso adecuado de la mascarilla facial, distanciamiento social (1)",{"$f":"GETPIVOTDATA(\"Suma de otros75\",TD!$A$285)","v":0}]
[null,null,39,"(T.S) Medidas preventivas frente al COVID-19: higiene respiratoria, uso adecuado de la mascarilla facial, distanciamiento social (1)",{"$f":"GETPIVOTDATA(\"Suma de otros76\",TD!$A$285)","v":0}]
[null,null,40,"Total",{"$f":"SUM(E190:E191)","v":0}]
[null,null,41,"(VD) Correcto uso del pulsioxímetros (2)",{"$f":"GETPIVOTDATA(\"Suma de otros77\",TD!$A$285)","v":0}]
[null,null,42,"(TS)Correcto uso del pulsioxímetros (2)",{"$f":"GETPIVOTDATA(\"Suma de otros78\",TD!$A$285)","v":0}]
[null,null,43,"Total",{"$f":"SUM(E193:E194)","v":0}]
[null,null,44,"(VD) Inmunización (3)",{"$f":"GETPIVOTDATA(\"Suma de otros79\",TD!$A$285)","v":0}]
[null,null,45,"(TS)Inmunización (3)",{"$f":"GETPIVOTDATA(\"Suma de otros80\",TD!$A$285)","v":0}]
[null,null,46,"Total",{"$f":"SUM(E196:E197)","v":0}]
[null,null,47,"(VD)Cuidado de PAMARs y PCDs con COVID (4)",{"$f":"GETPIVOTDATA(\"Suma de otros81\",TD!$A$285)","v":0}]
[null,null,48,"(TS)Cuidado de PAMARs y PCDs con COVID (4)",{"$f":"GETPIVOTDATA(\"Suma de otros82\",TD!$A$285)","v":0}]
[null,null,49,"Total",{"$f":"SUM(E199:E200)","v":0}]
[]
[null,null,50,"TRAZADOR ",{"$f":"E201+E198+E195+E192","v":0}]
[]
[null,null,null,"Conformación de comités comunitarios de salud para el fortalecimiento de acciones frente a problemas de salud pública "]
[]
[null,null,null,"Tipo de CCS","Nº registros"]
[null,null,51,"Si el Comité Comunitario de Salud es nuevo (1)",{"$f":"GETPIVOTDATA(\"Suma de otros56\",TD!$A$285)","v":0}]
[null,null,52,"Si el Comité Comunitario se está reactivando (2)",{"$f":"GETPIVOTDATA(\"Suma de otros58\",TD!$A$285)","v":0}]
[]
[null,null,null,"Reporte sobre centros de aislamiento temporal y seguimiento (CATS)"]
[]
[null,null,null,"Estado del CATS","Nº registros","Nº de referencias"]
[null,null,56,"Si el CATS se encuentra en proceso de implementación (1)",{"$f":"GETPIVOTDATA(\"Suma de otros59\",TD!$A$285)","v":0},{"$f":"GETPIVOTDATA(\"Suma de otros60\",TD!$A$285)","v":0}]
[]
[null,null,null,"Capacitación dirigida a miembros de comités comunitarios de salud sobre estilo de vida saludable y ambientes saludables en el contexto COVID-19"]
[]
[null,null,null,"Tématica","Nº registros","Nº de participantes "]
[null,null,58,"Medidas preventivas frente al COVID-19\n(1)",{"$f":"GETPIVOTDATA(\"Suma de otros61\",TD!$A$285)","v":0},{"$f":"GETPIVOTDATA(\"Suma de otros62\",TD!$A$285)","v":0}]
[null,null,59,"Correcto uso del pulsioxímetros\n(2)",{"$f":"GETPIVOTDATA(\"Suma de otros63\",TD!$A$285)","v":0},{"$f":"GETPIVOTDATA(\"Suma de otros64\",TD!$A$285)","v":0}]
[null,null,60,"Autocuidado\n(3)",{"$f":"GETPIVOTDATA(\"Suma de otros65\",TD!$A$285)","v":0},{"$f":"GETPIVOTDATA(\"Suma de otros66\",TD!$A$285)","v":0}]
[null,null,61,"Alimentación Saludable y Estilos de vida saludable\n(4)",{"$f":"GETPIVOTDATA(\"Suma de otros67\",TD!$A$285)","v":0},{"$f":"GETPIVOTDATA(\"Suma de otros68\",TD!$A$285)","v":0}]
[null,null,62,"Esquema de vacunación\n(5)",{"$f":"GETPIVOTDATA(\"Suma de otros69\",TD!$A$285)","v":0},{"$f":"GETPIVOTDATA(\"Suma de otros70\",TD!$A$285)","v":0}]
[null,null,63,"Cuidado de PAMARs y PCDs con COVID en casa\n(6)",{"$f":"GETPIVOTDATA(\"Suma de otros71\",TD!$A$285)","v":0},{"$f":"GETPIVOTDATA(\"Suma de otros72\",TD!$A$285)","v":0}]
[null,null,64,"TRAZADOR ",{"$f":"SUM(E219:E224)","v":0},{"$f":"SUM(F219:F224)","v":0}]